build error in fop-trunk

classic Classic list List threaded Threaded
7 messages Options
Reply | Threaded
Open this post in threaded view
|

build error in fop-trunk

jfrm.maurel@gmail.com
Hi,

I just cloned from git repository with:
git clone https://github.com/apache/xmlgraphics-fop.git

I build with:
mvn clean install

but the builds fails in the fop core task apparently from missing resources.

Am I doing something wrong to build fop ?

Regards

PS: I am on windows 10 if relevant

--
Jean-François MAUREL
PIMECA
http://www.pimeca.com


---------------------------------------------------------------------
To unsubscribe, e-mail: [hidden email]
For additional commands, e-mail: [hidden email]

Reply | Threaded
Open this post in threaded view
|

Re: build error in fop-trunk

Chris Bowditch
Hi,

Can you share the errors you are seeing? Also don't forget FOP supports
older Java versions so might need to build with Java 7

Thanks

Chris

On 10/03/2020 19:31, [hidden email] wrote:

> Hi,
>
> I just cloned from git repository with:
> git clone https://github.com/apache/xmlgraphics-fop.git
>
> I build with:
> mvn clean install
>
> but the builds fails in the fop core task apparently from missing
> resources.
>
> Am I doing something wrong to build fop ?
>
> Regards
>
> PS: I am on windows 10 if relevant
>


---------------------------------------------------------------------
To unsubscribe, e-mail: [hidden email]
For additional commands, e-mail: [hidden email]

Reply | Threaded
Open this post in threaded view
|

Re: build error in fop-trunk

jfrm.maurel@gmail.com

Hi Chris,

Thank you for your answer.

Le 18/03/2020 à 15:18, Chris Bowditch a écrit :
> Can you share the errors you are seeing?

Sure.

I investigated a little bit more:
1- an event-model.xml was missing because ANT_HOME was not set on my
computer if I am not mistaken.
A comment in the README file could help future users may be.
2- I suspect a problem of 'end of line' (I build on Windows 10 with java
8) in test org.apache.fop.accessibility.fo.FO2StructureTreeConverterTestCase
3- I pasted the full report from maven build below (don't if attachment
are allowed).

> Also don't forget FOP supports older Java versions so might need to
> build with Java 7
  Thanks for the tip.

Regards


===================
MAVEN BUILD REPORT
===================
[INFO] Scanning for projects...
[INFO]
------------------------------------------------------------------------
[INFO] Reactor Build Order:
[INFO]
[INFO] Apache FOP
Parent                                                  [pom]
[INFO] Apache FOP
Utilities                                               [jar]
[INFO] Apache FOP
Events                                                  [jar]
[INFO] Apache FOP
Core                                                    [jar]
[INFO] Apache FOP
All-In-One                                              [jar]
[INFO] Apache FOP
Sandbox                                                 [jar]
[INFO] Apache FOP
Servlet                                                 [war]
[INFO] Apache FOP
Transcoder                                              [jar]
[INFO] Apache FOP Transcoder
All-In-One                                   [jar]
[INFO]
[INFO] -----------------< org.apache.xmlgraphics:fop-parent
 >------------------
[INFO] Building Apache FOP Parent
2.5.0-SNAPSHOT                          [1/9]
[INFO] --------------------------------[ pom
]---------------------------------
[INFO]
[INFO] --- maven-clean-plugin:2.5:clean (default-clean) @ fop-parent ---
[INFO]
[INFO] --- maven-install-plugin:2.4:install (default-install) @
fop-parent ---
[INFO] Installing D:\git\xmlgraphics-fop\pom.xml to
C:\Users\mlamo\.m2\repository\org\apache\xmlgraphics\fop-parent\2.5.0-SNAPSHOT\fop-parent-2.5.0-SNAPSHOT.pom
[INFO]
[INFO] ------------------< org.apache.xmlgraphics:fop-util
 >-------------------
[INFO] Building Apache FOP Utilities
2.5.0-SNAPSHOT                       [2/9]
[INFO] --------------------------------[ jar
]---------------------------------
[INFO]
[INFO] --- maven-clean-plugin:2.5:clean (default-clean) @ fop-util ---
[INFO] Deleting D:\git\xmlgraphics-fop\fop-util\target
[INFO]
[INFO] --- maven-resources-plugin:2.6:resources (default-resources) @
fop-util ---
[INFO] Using 'UTF-8' encoding to copy filtered resources.
[INFO] skip non existing resourceDirectory
D:\git\xmlgraphics-fop\fop-util\src\main\resources
[INFO] Copying 2 resources to META-INF
[INFO]
[INFO] --- maven-compiler-plugin:3.1:compile (default-compile) @
fop-util ---
[INFO] Changes detected - recompiling the module!
[INFO] Compiling 3 source files to
D:\git\xmlgraphics-fop\fop-util\target\classes
[WARNING]
/D:/git/xmlgraphics-fop/fop-util/src/main/java/org/apache/fop/util/XMLResourceBundle.java:
D:\git\xmlgraphics-fop\fop-util\src\main\java\org\apache\fop\util\XMLResourceBundle.java
uses unchecked or unsafe operations.
[WARNING]
/D:/git/xmlgraphics-fop/fop-util/src/main/java/org/apache/fop/util/XMLResourceBundle.java:
Recompile with -Xlint:unchecked for details.
[INFO]
[INFO] --- maven-resources-plugin:2.6:testResources
(default-testResources) @ fop-util ---
[INFO] Using 'UTF-8' encoding to copy filtered resources.
[INFO] skip non existing resourceDirectory
D:\git\xmlgraphics-fop\fop-util\src\test\resources
[INFO]
[INFO] --- maven-compiler-plugin:3.1:testCompile (default-testCompile) @
fop-util ---
[INFO] No sources to compile
[INFO]
[INFO] --- maven-surefire-plugin:2.18.1:test (default-test) @ fop-util ---
[INFO] No tests to run.
[INFO]
[INFO] --- maven-jar-plugin:3.1.1:jar (default-jar) @ fop-util ---
[INFO] Building jar:
D:\git\xmlgraphics-fop\fop-util\target\fop-util-2.5.0-SNAPSHOT.jar
[INFO]
[INFO] --- maven-install-plugin:2.4:install (default-install) @ fop-util ---
[INFO] Installing
D:\git\xmlgraphics-fop\fop-util\target\fop-util-2.5.0-SNAPSHOT.jar to
C:\Users\mlamo\.m2\repository\org\apache\xmlgraphics\fop-util\2.5.0-SNAPSHOT\fop-util-2.5.0-SNAPSHOT.jar
[INFO] Installing D:\git\xmlgraphics-fop\fop-util\pom.xml to
C:\Users\mlamo\.m2\repository\org\apache\xmlgraphics\fop-util\2.5.0-SNAPSHOT\fop-util-2.5.0-SNAPSHOT.pom
[INFO]
[INFO] -----------------< org.apache.xmlgraphics:fop-events
 >------------------
[INFO] Building Apache FOP Events
2.5.0-SNAPSHOT                          [3/9]
[INFO] --------------------------------[ jar
]---------------------------------
[INFO]
[INFO] --- maven-clean-plugin:2.5:clean (default-clean) @ fop-events ---
[INFO] Deleting D:\git\xmlgraphics-fop\fop-events\target
[INFO]
[INFO] --- maven-resources-plugin:2.6:resources (default-resources) @
fop-events ---
[INFO] Using 'UTF-8' encoding to copy filtered resources.
[INFO] Copying 2 resources
[INFO] Copying 2 resources to META-INF
[INFO]
[INFO] --- maven-compiler-plugin:3.1:compile (default-compile) @
fop-events ---
[INFO] Changes detected - recompiling the module!
[INFO] Compiling 16 source files to
D:\git\xmlgraphics-fop\fop-events\target\classes
[WARNING]
/D:/git/xmlgraphics-fop/fop-events/src/main/java/org/apache/fop/events/model/EventModel.java:
Some input files use unchecked or unsafe operations.
[WARNING]
/D:/git/xmlgraphics-fop/fop-events/src/main/java/org/apache/fop/events/model/EventModel.java:
Recompile with -Xlint:unchecked for details.
[INFO]
[INFO] --- maven-resources-plugin:2.6:testResources
(default-testResources) @ fop-events ---
[INFO] Using 'UTF-8' encoding to copy filtered resources.
[INFO] skip non existing resourceDirectory
D:\git\xmlgraphics-fop\fop-events\src\test\resources
[INFO]
[INFO] --- maven-compiler-plugin:3.1:testCompile (default-testCompile) @
fop-events ---
[INFO] Changes detected - recompiling the module!
[INFO] Compiling 2 source files to
D:\git\xmlgraphics-fop\fop-events\target\test-classes
[INFO]
[INFO] --- maven-antrun-plugin:1.8:run (codegen-test-events) @
fop-events ---
[INFO] Executing tasks

main:
[collectEvents] Event model written to
D:\git\xmlgraphics-fop\fop-events\target\test-classes\org\apache\fop\events\event-model.xml
[INFO] Executed tasks
[INFO]
[INFO] --- maven-surefire-plugin:2.18.1:test (default-test) @ fop-events ---
[INFO] Surefire report directory:
D:\git\xmlgraphics-fop\fop-events\target\surefire-reports

-------------------------------------------------------
  T E S T S
-------------------------------------------------------
Running org.apache.fop.events.BasicEventTestCase
Tests run: 2, Failures: 0, Errors: 0, Skipped: 0, Time elapsed: 0.049
sec - in org.apache.fop.events.BasicEventTestCase

Results :

Tests run: 2, Failures: 0, Errors: 0, Skipped: 0

[INFO]
[INFO] --- maven-jar-plugin:3.1.1:jar (default-jar) @ fop-events ---
[INFO] Building jar:
D:\git\xmlgraphics-fop\fop-events\target\fop-events-2.5.0-SNAPSHOT.jar
[INFO]
[INFO] --- maven-install-plugin:2.4:install (default-install) @
fop-events ---
[INFO] Installing
D:\git\xmlgraphics-fop\fop-events\target\fop-events-2.5.0-SNAPSHOT.jar
to
C:\Users\mlamo\.m2\repository\org\apache\xmlgraphics\fop-events\2.5.0-SNAPSHOT\fop-events-2.5.0-SNAPSHOT.jar
[INFO] Installing D:\git\xmlgraphics-fop\fop-events\pom.xml to
C:\Users\mlamo\.m2\repository\org\apache\xmlgraphics\fop-events\2.5.0-SNAPSHOT\fop-events-2.5.0-SNAPSHOT.pom
[INFO]
[INFO] ------------------< org.apache.xmlgraphics:fop-core
 >-------------------
[INFO] Building Apache FOP Core
2.5.0-SNAPSHOT                            [4/9]
[INFO] --------------------------------[ jar
]---------------------------------
[INFO]
[INFO] --- maven-clean-plugin:2.5:clean (default-clean) @ fop-core ---
[INFO]
[INFO] --- xml-maven-plugin:1.0.1:transform (generate-base14-fonts) @
fop-core ---
[INFO] Transforming file:
D:\git\xmlgraphics-fop\fop-core\src\main\codegen\fonts\Courier.xml
[INFO] Transforming file:
D:\git\xmlgraphics-fop\fop-core\src\main\codegen\fonts\CourierBold.xml
[INFO] Transforming file:
D:\git\xmlgraphics-fop\fop-core\src\main\codegen\fonts\CourierBoldOblique.xml
[INFO] Transforming file:
D:\git\xmlgraphics-fop\fop-core\src\main\codegen\fonts\CourierOblique.xml
[INFO] Transforming file:
D:\git\xmlgraphics-fop\fop-core\src\main\codegen\fonts\Helvetica.xml
[INFO] Transforming file:
D:\git\xmlgraphics-fop\fop-core\src\main\codegen\fonts\HelveticaBold.xml
[INFO] Transforming file:
D:\git\xmlgraphics-fop\fop-core\src\main\codegen\fonts\HelveticaBoldOblique.xml
[INFO] Transforming file:
D:\git\xmlgraphics-fop\fop-core\src\main\codegen\fonts\HelveticaOblique.xml
[INFO] Transforming file:
D:\git\xmlgraphics-fop\fop-core\src\main\codegen\fonts\TimesBold.xml
[INFO] Transforming file:
D:\git\xmlgraphics-fop\fop-core\src\main\codegen\fonts\TimesBoldItalic.xml
[INFO] Transforming file:
D:\git\xmlgraphics-fop\fop-core\src\main\codegen\fonts\TimesItalic.xml
[INFO] Transforming file:
D:\git\xmlgraphics-fop\fop-core\src\main\codegen\fonts\TimesRoman.xml
[INFO] Transformed 12 file(s).
[INFO] Transforming file:
D:\git\xmlgraphics-fop\fop-core\src\main\codegen\fonts\Symbol.xml
[INFO] Transforming file:
D:\git\xmlgraphics-fop\fop-core\src\main\codegen\fonts\ZapfDingbats.xml
[INFO] Transformed 2 file(s).
[INFO]
[INFO] --- xml-maven-plugin:1.0.1:transform (codegen-fonts-encodings) @
fop-core ---
[INFO] Transforming file:
D:\git\xmlgraphics-fop\fop-core\src\main\codegen\fonts\encodings.xml
[INFO] Transformed 1 file(s).
[INFO]
[INFO] --- build-helper-maven-plugin:1.9.1:add-source
(add-generated-sources) @ fop-core ---
[INFO] Source directory:
D:\git\xmlgraphics-fop\fop-core\target\generated-sources\main\java added.
[INFO]
[INFO] --- maven-resources-plugin:2.6:resources (default-resources) @
fop-core ---
[INFO] Using 'UTF-8' encoding to copy filtered resources.
[INFO] Copying 59 resources
[INFO] Copying 2 resources to META-INF
[INFO]
[INFO] --- maven-compiler-plugin:3.1:compile (default-compile) @
fop-core ---
[INFO] Changes detected - recompiling the module!
[INFO] Compiling 1559 source files to
D:\git\xmlgraphics-fop\fop-core\target\classes
[WARNING]
/D:/git/xmlgraphics-fop/fop-core/src/main/java/org/apache/fop/fonts/LazyFont.java:
D:\git\xmlgraphics-fop\fop-core\src\main\java\org\apache\fop\fonts\LazyFont.java
uses or overrides a deprecated API.
[WARNING]
/D:/git/xmlgraphics-fop/fop-core/src/main/java/org/apache/fop/fonts/LazyFont.java:
Recompile with -Xlint:deprecation for details.
[WARNING]
/D:/git/xmlgraphics-fop/fop-core/src/main/java/org/apache/fop/util/AbstractPaintingState.java:
Some input files use unchecked or unsafe operations.
[WARNING]
/D:/git/xmlgraphics-fop/fop-core/src/main/java/org/apache/fop/util/AbstractPaintingState.java:
Recompile with -Xlint:unchecked for details.
[INFO]
[INFO] --- maven-antrun-plugin:1.8:run (codegen-events) @ fop-core ---
[INFO] Executing tasks

main:
[collectEvents] Event model written to
D:\git\xmlgraphics-fop\fop-core\target\classes\org\apache\fop\event-model.xml
[collectEvents] Event model written to
D:\git\xmlgraphics-fop\fop-core\target\classes\org\apache\fop\accessibility\event-model.xml
[collectEvents] Event model written to
D:\git\xmlgraphics-fop\fop-core\target\classes\org\apache\fop\afp\event-model.xml
[collectEvents] Event model written to
D:\git\xmlgraphics-fop\fop-core\target\classes\org\apache\fop\area\event-model.xml
[collectEvents] Event model written to
D:\git\xmlgraphics-fop\fop-core\target\classes\org\apache\fop\fo\event-model.xml
[collectEvents] Event model written to
D:\git\xmlgraphics-fop\fop-core\target\classes\org\apache\fop\fo\flow\table\event-model.xml
[collectEvents] Event model written to
D:\git\xmlgraphics-fop\fop-core\target\classes\org\apache\fop\fonts\event-model.xml
[collectEvents] Event model written to
D:\git\xmlgraphics-fop\fop-core\target\classes\org\apache\fop\layoutmgr\event-model.xml
[collectEvents] Event model written to
D:\git\xmlgraphics-fop\fop-core\target\classes\org\apache\fop\layoutmgr\inline\event-model.xml
[collectEvents] Event model written to
D:\git\xmlgraphics-fop\fop-core\target\classes\org\apache\fop\render\event-model.xml
[collectEvents] Event model written to
D:\git\xmlgraphics-fop\fop-core\target\classes\org\apache\fop\render\bitmap\event-model.xml
[collectEvents] Event model written to
D:\git\xmlgraphics-fop\fop-core\target\classes\org\apache\fop\render\pcl\event-model.xml
[collectEvents] Event model written to
D:\git\xmlgraphics-fop\fop-core\target\classes\org\apache\fop\render\pdf\event-model.xml
[collectEvents] Event model written to
D:\git\xmlgraphics-fop\fop-core\target\classes\org\apache\fop\render\pdf\extensions\event-model.xml
[collectEvents] Event model written to
D:\git\xmlgraphics-fop\fop-core\target\classes\org\apache\fop\render\ps\event-model.xml
[collectEvents] Event model written to
D:\git\xmlgraphics-fop\fop-core\target\classes\org\apache\fop\render\rtf\event-model.xml
[collectEvents] Event model written to
D:\git\xmlgraphics-fop\fop-core\target\classes\org\apache\fop\svg\event-model.xml
[INFO] Executed tasks
[INFO]
[INFO] --- maven-resources-plugin:2.6:testResources
(default-testResources) @ fop-core ---
[INFO] Using 'UTF-8' encoding to copy filtered resources.
[INFO] Copying 685 resources
[INFO]
[INFO] --- maven-compiler-plugin:3.1:testCompile (default-testCompile) @
fop-core ---
[INFO] Changes detected - recompiling the module!
[INFO] Compiling 404 source files to
D:\git\xmlgraphics-fop\fop-core\target\test-classes
[WARNING]
/D:/git/xmlgraphics-fop/fop-core/src/test/java/org/apache/fop/fo/flow/table/TableHandler.java:
Some input files use unchecked or unsafe operations.
[WARNING]
/D:/git/xmlgraphics-fop/fop-core/src/test/java/org/apache/fop/fo/flow/table/TableHandler.java:
Recompile with -Xlint:unchecked for details.
[INFO]
[INFO] --- maven-surefire-plugin:2.18.1:test (default-test) @ fop-core ---
[INFO] Surefire report directory:
D:\git\xmlgraphics-fop\fop-core\target\surefire-reports

-------------------------------------------------------
  T E S T S
-------------------------------------------------------
Running org.apache.fop.accessibility.fo.ArtifactImageBugTestCase
Tests run: 1, Failures: 0, Errors: 0, Skipped: 0, Time elapsed: 11.465
sec - in org.apache.fop.accessibility.fo.ArtifactImageBugTestCase
Running org.apache.fop.accessibility.fo.FO2StructureTreeConverterTestCase
Tests run: 9, Failures: 1, Errors: 0, Skipped: 0, Time elapsed: 0.864
sec <<< FAILURE! - in
org.apache.fop.accessibility.fo.FO2StructureTreeConverterTestCase
testRemoveBlocks(org.apache.fop.accessibility.fo.FO2StructureTreeConverterTestCase)
Time elapsed: 0.017 sec  <<< FAILURE!
org.junit.ComparisonFailure: expected:<...cture-tree-sequence>[
<structure-tree xmlns="http://xmlgraphics.apache.org/fop/intermediate"
xmlns:foi="http://xmlgraphics.apache.org/fop/internal"
xmlns:fox="http://xmlgraphics.apache.org/fop/extensions">
<fo:flow xmlns:fo="http://www.w3.org/1999/XSL/Format"
flow-name="xsl-region-body">
<fo:block>
<marked-content/>
</fo:block>
</fo:flow>
</structure-tree>
</structure-tree-sequence>]
 > but was:<...cture-tree-sequence>[
<structure-tree xmlns="http://xmlgraphics.apache.org/fop/intermediate"
xmlns:foi="http://xmlgraphics.apache.org/fop/internal"
xmlns:fox="http://xmlgraphics.apache.org/fop/extensions">
<fo:flow xmlns:fo="http://www.w3.org/1999/XSL/Format"
flow-name="xsl-region-body">
<fo:block>
<marked-content/>
</fo:block>
</fo:flow>
</structure-tree>
</structure-tree-sequence>
]
 >
     at org.junit.Assert.assertEquals(Assert.java:115)
     at org.junit.Assert.assertEquals(Assert.java:144)
     at
org.apache.fop.accessibility.fo.FO2StructureTreeConverterTestCase.compare(FO2StructureTreeConverterTestCase.java:183)
     at
org.apache.fop.accessibility.fo.FO2StructureTreeConverterTestCase.testRemoveBlocks(FO2StructureTreeConverterTestCase.java:142)

Running org.apache.fop.accessibility.fo.PDFUAWarningTestCase
Tests run: 1, Failures: 0, Errors: 0, Skipped: 0, Time elapsed: 0 sec -
in org.apache.fop.accessibility.fo.PDFUAWarningTestCase
Running org.apache.fop.accessibility.pdf.FootnoteSeparatorTestCase
Tests run: 1, Failures: 0, Errors: 0, Skipped: 0, Time elapsed: 0 sec -
in org.apache.fop.accessibility.pdf.FootnoteSeparatorTestCase
Running org.apache.fop.accessibility.pdf.MissingLanguageWarningTestCase
Tests run: 1, Failures: 0, Errors: 0, Skipped: 0, Time elapsed: 0.24 sec
- in org.apache.fop.accessibility.pdf.MissingLanguageWarningTestCase
Running org.apache.fop.afp.AFPEventProcessingTestCase
Tests run: 5, Failures: 0, Errors: 0, Skipped: 0, Time elapsed: 0.842
sec - in org.apache.fop.afp.AFPEventProcessingTestCase
Running org.apache.fop.afp.AFPGraphics2DTestCase
Tests run: 1, Failures: 0, Errors: 0, Skipped: 0, Time elapsed: 0.226
sec - in org.apache.fop.afp.AFPGraphics2DTestCase
Running org.apache.fop.afp.AFPObjectAreaInfoTestCase
Tests run: 2, Failures: 0, Errors: 0, Skipped: 0, Time elapsed: 0 sec -
in org.apache.fop.afp.AFPObjectAreaInfoTestCase
Running org.apache.fop.afp.AFPPaintingStateTestCase
Tests run: 1, Failures: 0, Errors: 0, Skipped: 0, Time elapsed: 0 sec -
in org.apache.fop.afp.AFPPaintingStateTestCase
Running org.apache.fop.afp.AFPResourceManagerTestCase
Tests run: 3, Failures: 0, Errors: 0, Skipped: 0, Time elapsed: 0.118
sec - in org.apache.fop.afp.AFPResourceManagerTestCase
Running org.apache.fop.afp.AFPResourceUtilTestCase
Tests run: 6, Failures: 0, Errors: 0, Skipped: 0, Time elapsed: 0.088
sec - in org.apache.fop.afp.AFPResourceUtilTestCase
Running org.apache.fop.afp.fonts.CharactersetEncoderTestCase
Tests run: 2, Failures: 0, Errors: 0, Skipped: 0, Time elapsed: 0.006
sec - in org.apache.fop.afp.fonts.CharactersetEncoderTestCase
Running org.apache.fop.afp.fonts.IntegerKeyStoreTestCase
Tests run: 1, Failures: 0, Errors: 0, Skipped: 0, Time elapsed: 0 sec -
in org.apache.fop.afp.fonts.IntegerKeyStoreTestCase
Running org.apache.fop.afp.goca.GraphicsCharacterStringTestCase
Tests run: 1, Failures: 0, Errors: 0, Skipped: 0, Time elapsed: 0.001
sec - in org.apache.fop.afp.goca.GraphicsCharacterStringTestCase
Running org.apache.fop.afp.goca.GraphicsSetFractionalLineWidthTestCase
Tests run: 3, Failures: 0, Errors: 0, Skipped: 0, Time elapsed: 0 sec -
in org.apache.fop.afp.goca.GraphicsSetFractionalLineWidthTestCase
Running org.apache.fop.afp.goca.GraphicsSetLineWidthTestCase
Tests run: 3, Failures: 0, Errors: 0, Skipped: 0, Time elapsed: 0 sec -
in org.apache.fop.afp.goca.GraphicsSetLineWidthTestCase
Running org.apache.fop.afp.modca.GraphicsObjectTestCase
Tests run: 1, Failures: 0, Errors: 0, Skipped: 0, Time elapsed: 0.011
sec - in org.apache.fop.afp.modca.GraphicsObjectTestCase
Running org.apache.fop.afp.modca.IncludeObjectTestCase
Tests run: 7, Failures: 0, Errors: 0, Skipped: 0, Time elapsed: 0.021
sec - in org.apache.fop.afp.modca.IncludeObjectTestCase
Running org.apache.fop.afp.parser.MODCAParserTestCase
Tests run: 2, Failures: 0, Errors: 0, Skipped: 0, Time elapsed: 0 sec -
in org.apache.fop.afp.parser.MODCAParserTestCase
Running org.apache.fop.afp.ptoca.TransparentDataControlSequenceTestCase
Tests run: 2, Failures: 0, Errors: 0, Skipped: 0, Time elapsed: 0.152
sec - in org.apache.fop.afp.ptoca.TransparentDataControlSequenceTestCase
Running org.apache.fop.afp.util.AFPResourceAccessorTestCase
Tests run: 2, Failures: 0, Errors: 0, Skipped: 0, Time elapsed: 0.013
sec - in org.apache.fop.afp.util.AFPResourceAccessorTestCase
Running org.apache.fop.apps.EnvironmentalProfileFactoryTestCase
Tests run: 1, Failures: 0, Errors: 0, Skipped: 0, Time elapsed: 0 sec -
in org.apache.fop.apps.EnvironmentalProfileFactoryTestCase
Running org.apache.fop.apps.FopConfParserTestCase
Tests run: 14, Failures: 0, Errors: 0, Skipped: 0, Time elapsed: 0.039
sec - in org.apache.fop.apps.FopConfParserTestCase
Running org.apache.fop.apps.FopFactoryBuilderTestCase
Tests run: 15, Failures: 0, Errors: 0, Skipped: 0, Time elapsed: 0.131
sec - in org.apache.fop.apps.FopFactoryBuilderTestCase
Running org.apache.fop.apps.FopFactoryTestCase
Tests run: 1, Failures: 0, Errors: 0, Skipped: 0, Time elapsed: 0.117
sec - in org.apache.fop.apps.FopFactoryTestCase
Running org.apache.fop.apps.io.ResourceResolverFactoryTestCase
Tests run: 10, Failures: 0, Errors: 0, Skipped: 0, Time elapsed: 0.064
sec - in org.apache.fop.apps.io.ResourceResolverFactoryTestCase
Running org.apache.fop.apps.io.URIResolverWrapperTestCase
Tests run: 4, Failures: 0, Errors: 0, Skipped: 0, Time elapsed: 0.017
sec - in org.apache.fop.apps.io.URIResolverWrapperTestCase
Running org.apache.fop.area.BlockViewportTestCase
Tests run: 2, Failures: 0, Errors: 0, Skipped: 0, Time elapsed: 0 sec -
in org.apache.fop.area.BlockViewportTestCase
Running org.apache.fop.area.inline.InlineViewportTestCase
Tests run: 2, Failures: 0, Errors: 0, Skipped: 0, Time elapsed: 0.001
sec - in org.apache.fop.area.inline.InlineViewportTestCase
Running org.apache.fop.area.RegionViewportTestCase
Tests run: 2, Failures: 0, Errors: 0, Skipped: 0, Time elapsed: 0 sec -
in org.apache.fop.area.RegionViewportTestCase
Running org.apache.fop.area.TraitTestCase
Tests run: 1, Failures: 0, Errors: 0, Skipped: 0, Time elapsed: 0 sec -
in org.apache.fop.area.TraitTestCase
Running org.apache.fop.BasicDriverTestCase
Tests run: 5, Failures: 0, Errors: 0, Skipped: 0, Time elapsed: 0.609
sec - in org.apache.fop.BasicDriverTestCase
Running org.apache.fop.BasicPDFTranscoderTestCase
Tests run: 1, Failures: 0, Errors: 0, Skipped: 0, Time elapsed: 0.814
sec - in org.apache.fop.BasicPDFTranscoderTestCase
Running org.apache.fop.BasicPSTranscoderTestCase
Tests run: 1, Failures: 0, Errors: 0, Skipped: 0, Time elapsed: 0.159
sec - in org.apache.fop.BasicPSTranscoderTestCase
Running org.apache.fop.cli.CommandLineOptionsTestCase
Tests run: 3, Failures: 0, Errors: 0, Skipped: 0, Time elapsed: 0.032
sec - in org.apache.fop.cli.CommandLineOptionsTestCase
Running org.apache.fop.complexscripts.bidi.BidiAlgorithmTestCase
Tests run: 1, Failures: 0, Errors: 0, Skipped: 0, Time elapsed: 4.04 sec
- in org.apache.fop.complexscripts.bidi.BidiAlgorithmTestCase
Running org.apache.fop.complexscripts.bidi.BidiClassTestCase
Tests run: 1, Failures: 0, Errors: 0, Skipped: 0, Time elapsed: 0.109
sec - in org.apache.fop.complexscripts.bidi.BidiClassTestCase
Running org.apache.fop.complexscripts.fonts.GDEFTestCase
Tests run: 4, Failures: 0, Errors: 0, Skipped: 0, Time elapsed: 0.356
sec - in org.apache.fop.complexscripts.fonts.GDEFTestCase
Running org.apache.fop.complexscripts.fonts.GPOSTestCase
Tests run: 8, Failures: 0, Errors: 0, Skipped: 0, Time elapsed: 0.032
sec - in org.apache.fop.complexscripts.fonts.GPOSTestCase
Running org.apache.fop.complexscripts.fonts.GSUBTestCase
Tests run: 6, Failures: 0, Errors: 0, Skipped: 0, Time elapsed: 0.033
sec - in org.apache.fop.complexscripts.fonts.GSUBTestCase
Running org.apache.fop.complexscripts.fonts.ttx.TTXFileTestCase
Tests run: 1, Failures: 0, Errors: 0, Skipped: 0, Time elapsed: 0 sec -
in org.apache.fop.complexscripts.fonts.ttx.TTXFileTestCase
Running org.apache.fop.complexscripts.layout.ComplexScriptsLayoutTestCase
Tests run: 1, Failures: 0, Errors: 0, Skipped: 0, Time elapsed: 0.115
sec - in org.apache.fop.complexscripts.layout.ComplexScriptsLayoutTestCase
Running org.apache.fop.complexscripts.scripts.arabic.ArabicJoinersTestCase
Tests run: 2, Failures: 0, Errors: 0, Skipped: 0, Time elapsed: 0.024
sec - in org.apache.fop.complexscripts.scripts.arabic.ArabicJoinersTestCase
Running org.apache.fop.complexscripts.scripts.arabic.ArabicWordFormsTestCase
Tests run: 1, Failures: 0, Errors: 0, Skipped: 0, Time elapsed: 19.008
sec - in
org.apache.fop.complexscripts.scripts.arabic.ArabicWordFormsTestCase
Running org.apache.fop.complexscripts.scripts.KhmerTestCase
Tests run: 4, Failures: 0, Errors: 0, Skipped: 0, Time elapsed: 0.057
sec - in org.apache.fop.complexscripts.scripts.KhmerTestCase
Running org.apache.fop.complexscripts.util.NumberConverterTestCase
Tests run: 13, Failures: 0, Errors: 0, Skipped: 0, Time elapsed: 0.047
sec - in org.apache.fop.complexscripts.util.NumberConverterTestCase
Running org.apache.fop.config.FontAttributesMissingTestCase
Tests run: 1, Failures: 0, Errors: 0, Skipped: 0, Time elapsed: 0.002
sec - in org.apache.fop.config.FontAttributesMissingTestCase
Running org.apache.fop.config.FontMetricsUrlBadTestCase
Tests run: 1, Failures: 0, Errors: 0, Skipped: 0, Time elapsed: 0.001
sec - in org.apache.fop.config.FontMetricsUrlBadTestCase
Running org.apache.fop.config.FontMetricsUrlMalformedTestCase
Tests run: 1, Failures: 0, Errors: 0, Skipped: 0, Time elapsed: 0.001
sec - in org.apache.fop.config.FontMetricsUrlMalformedTestCase
Running org.apache.fop.config.FontsAutoDetectTestCase
Tests run: 1, Failures: 0, Errors: 0, Skipped: 0, Time elapsed: 0.277
sec - in org.apache.fop.config.FontsAutoDetectTestCase
Running org.apache.fop.config.FontsDirectoryRecursiveTestCase
Tests run: 1, Failures: 0, Errors: 0, Skipped: 0, Time elapsed: 0.023
sec - in org.apache.fop.config.FontsDirectoryRecursiveTestCase
Running org.apache.fop.config.FontsSubstitutionTestCase
Tests run: 1, Failures: 0, Errors: 0, Skipped: 0, Time elapsed: 0.027
sec - in org.apache.fop.config.FontsSubstitutionTestCase
Running org.apache.fop.config.FontTripletAttributeMissingTestCase
Tests run: 1, Failures: 0, Errors: 0, Skipped: 0, Time elapsed: 0 sec -
in org.apache.fop.config.FontTripletAttributeMissingTestCase
Running org.apache.fop.datatypes.URISpecificationTestCase
Tests run: 2, Failures: 0, Errors: 0, Skipped: 0, Time elapsed: 0 sec -
in org.apache.fop.datatypes.URISpecificationTestCase
Running org.apache.fop.DigestFilterTestCase
Tests run: 3, Failures: 0, Errors: 0, Skipped: 0, Time elapsed: 0.008
sec - in org.apache.fop.DigestFilterTestCase
Running org.apache.fop.events.EventProcessingTestCase
Tests run: 10, Failures: 0, Errors: 0, Skipped: 0, Time elapsed: 0.283
sec - in org.apache.fop.events.EventProcessingTestCase
Running org.apache.fop.events.FlowNamedNotMappedTestCase
Tests run: 1, Failures: 0, Errors: 0, Skipped: 0, Time elapsed: 0.008
sec - in org.apache.fop.events.FlowNamedNotMappedTestCase
Running org.apache.fop.fo.DelegatingFOEventHandlerTestCase
Tests run: 1, Failures: 0, Errors: 0, Skipped: 0, Time elapsed: 0.04 sec
- in org.apache.fop.fo.DelegatingFOEventHandlerTestCase
Running org.apache.fop.fo.flow.MarkersTestCase
Tests run: 1, Failures: 0, Errors: 0, Skipped: 0, Time elapsed: 0.024
sec - in org.apache.fop.fo.flow.MarkersTestCase
Running org.apache.fop.fo.flow.table.CollapsedConditionalBorderTestCase
Tests run: 2, Failures: 0, Errors: 0, Skipped: 0, Time elapsed: 0.039
sec - in org.apache.fop.fo.flow.table.CollapsedConditionalBorderTestCase
Running org.apache.fop.fo.flow.table.HeaderColumnTestCase
Tests run: 2, Failures: 0, Errors: 0, Skipped: 0, Time elapsed: 0.04 sec
- in org.apache.fop.fo.flow.table.HeaderColumnTestCase
Running org.apache.fop.fo.flow.table.IllegalRowSpanTestCase
Tests run: 4, Failures: 0, Errors: 0, Skipped: 0, Time elapsed: 0.015
sec - in org.apache.fop.fo.flow.table.IllegalRowSpanTestCase
Running org.apache.fop.fo.flow.table.RowGroupBuilderTestCase
Tests run: 8, Failures: 0, Errors: 0, Skipped: 0, Time elapsed: 0.08 sec
- in org.apache.fop.fo.flow.table.RowGroupBuilderTestCase
Running org.apache.fop.fo.flow.table.TableColumnColumnNumberTestCase
Tests run: 2, Failures: 0, Errors: 0, Skipped: 0, Time elapsed: 0.013
sec - in org.apache.fop.fo.flow.table.TableColumnColumnNumberTestCase
Running org.apache.fop.fo.flow.table.TooManyColumnsTestCase
Tests run: 6, Failures: 0, Errors: 0, Skipped: 0, Time elapsed: 0.015
sec - in org.apache.fop.fo.flow.table.TooManyColumnsTestCase
Running org.apache.fop.fo.pagination.LayoutMasterSetTestCase
Tests run: 1, Failures: 0, Errors: 0, Skipped: 0, Time elapsed: 0.013
sec - in org.apache.fop.fo.pagination.LayoutMasterSetTestCase
Running org.apache.fop.fo.pagination.PageSequenceMasterTestCase
Tests run: 2, Failures: 0, Errors: 0, Skipped: 0, Time elapsed: 0.042
sec - in org.apache.fop.fo.pagination.PageSequenceMasterTestCase
Running
org.apache.fop.fo.pagination.RepeatablePageMasterAlternativesTestCase
Tests run: 4, Failures: 0, Errors: 0, Skipped: 0, Time elapsed: 0.029
sec - in
org.apache.fop.fo.pagination.RepeatablePageMasterAlternativesTestCase
Running org.apache.fop.fo.properties.AltTextHolderTestCase
Tests run: 2, Failures: 0, Errors: 0, Skipped: 0, Time elapsed: 0.023
sec - in org.apache.fop.fo.properties.AltTextHolderTestCase
Running org.apache.fop.fo.properties.CommonAccessibilityHolderTestCase
Tests run: 1, Failures: 0, Errors: 0, Skipped: 0, Time elapsed: 0.039
sec - in org.apache.fop.fo.properties.CommonAccessibilityHolderTestCase
Running org.apache.fop.fo.properties.CommonHyphenationTestCase
Tests run: 3, Failures: 0, Errors: 0, Skipped: 0, Time elapsed: 0 sec -
in org.apache.fop.fo.properties.CommonHyphenationTestCase
Running org.apache.fop.fonts.cff.CFFDataReaderTestCase
Tests run: 2, Failures: 0, Errors: 0, Skipped: 0, Time elapsed: 0.025
sec - in org.apache.fop.fonts.cff.CFFDataReaderTestCase
Running org.apache.fop.fonts.CIDFullTestCase
Tests run: 9, Failures: 0, Errors: 0, Skipped: 0, Time elapsed: 0.017
sec - in org.apache.fop.fonts.CIDFullTestCase
Running org.apache.fop.fonts.CIDSubsetTestCase
Tests run: 9, Failures: 0, Errors: 0, Skipped: 0, Time elapsed: 0.002
sec - in org.apache.fop.fonts.CIDSubsetTestCase
Running org.apache.fop.fonts.DejaVuLGCSerifTestCase
Tests run: 3, Failures: 0, Errors: 0, Skipped: 0, Time elapsed: 0.019
sec - in org.apache.fop.fonts.DejaVuLGCSerifTestCase
Running org.apache.fop.fonts.EmbedFontInfoTestCase
Tests run: 3, Failures: 0, Errors: 0, Skipped: 0, Time elapsed: 0 sec -
in org.apache.fop.fonts.EmbedFontInfoTestCase
Running org.apache.fop.fonts.EncodingModeTestCase
Tests run: 3, Failures: 0, Errors: 0, Skipped: 0, Time elapsed: 0 sec -
in org.apache.fop.fonts.EncodingModeTestCase
Running org.apache.fop.fonts.FontEventProcessingTestCase
Tests run: 2, Failures: 0, Errors: 0, Skipped: 0, Time elapsed: 0.023
sec - in org.apache.fop.fonts.FontEventProcessingTestCase
Running org.apache.fop.fonts.FontManagerConfiguratorTestCase
Tests run: 6, Failures: 0, Errors: 0, Skipped: 0, Time elapsed: 0.01 sec
- in org.apache.fop.fonts.FontManagerConfiguratorTestCase
Running org.apache.fop.fonts.FontManagerTestCase
Tests run: 5, Failures: 0, Errors: 0, Skipped: 0, Time elapsed: 0.009
sec - in org.apache.fop.fonts.FontManagerTestCase
Running org.apache.fop.fonts.FontSelectorTestCase
Tests run: 1, Failures: 0, Errors: 0, Skipped: 0, Time elapsed: 0.033
sec - in org.apache.fop.fonts.FontSelectorTestCase
Running org.apache.fop.fonts.LazyFontTestCase
Tests run: 1, Failures: 0, Errors: 0, Skipped: 0, Time elapsed: 0 sec -
in org.apache.fop.fonts.LazyFontTestCase
Running org.apache.fop.fonts.truetype.FontFileReaderTestCase
Tests run: 15, Failures: 0, Errors: 0, Skipped: 0, Time elapsed: 0 sec -
in org.apache.fop.fonts.truetype.FontFileReaderTestCase
Running org.apache.fop.fonts.truetype.GlyfTableTestCase
Tests run: 4, Failures: 0, Errors: 0, Skipped: 0, Time elapsed: 0.011
sec - in org.apache.fop.fonts.truetype.GlyfTableTestCase
Running org.apache.fop.fonts.truetype.OTFFileTestCase
Tests run: 3, Failures: 0, Errors: 0, Skipped: 0, Time elapsed: 0.019
sec - in org.apache.fop.fonts.truetype.OTFFileTestCase
Running org.apache.fop.fonts.truetype.OTFSubSetFileTestCase
Tests run: 14, Failures: 0, Errors: 0, Skipped: 0, Time elapsed: 0.18
sec - in org.apache.fop.fonts.truetype.OTFSubSetFileTestCase
Running org.apache.fop.fonts.truetype.OTFToType1TestCase
Tests run: 2, Failures: 0, Errors: 0, Skipped: 0, Time elapsed: 0.036
sec - in org.apache.fop.fonts.truetype.OTFToType1TestCase
Running org.apache.fop.fonts.truetype.TTFFileTestCase
Tests run: 30, Failures: 0, Errors: 0, Skipped: 0, Time elapsed: 0.193
sec - in org.apache.fop.fonts.truetype.TTFFileTestCase
Running org.apache.fop.fonts.truetype.TTFFontLoaderTestCase
Tests run: 1, Failures: 0, Errors: 0, Skipped: 0, Time elapsed: 0.011
sec - in org.apache.fop.fonts.truetype.TTFFontLoaderTestCase
Running org.apache.fop.fonts.truetype.TTFSubSetFileTestCase
Tests run: 31, Failures: 0, Errors: 0, Skipped: 0, Time elapsed: 0.141
sec - in org.apache.fop.fonts.truetype.TTFSubSetFileTestCase
Running org.apache.fop.fonts.truetype.TTFTableNameTestCase
Tests run: 4, Failures: 0, Errors: 0, Skipped: 0, Time elapsed: 0 sec -
in org.apache.fop.fonts.truetype.TTFTableNameTestCase
Running org.apache.fop.fonts.type1.AdobeStandardEncodingTestCase
Tests run: 1, Failures: 0, Errors: 0, Skipped: 0, Time elapsed: 0.009
sec - in org.apache.fop.fonts.type1.AdobeStandardEncodingTestCase
Running org.apache.fop.fonts.type1.AFMParserTestCase
Tests run: 2, Failures: 0, Errors: 0, Skipped: 0, Time elapsed: 0.17 sec
- in org.apache.fop.fonts.type1.AFMParserTestCase
Running org.apache.fop.fonts.type1.CharMetricsHandlerTestCase
Tests run: 1, Failures: 0, Errors: 0, Skipped: 0, Time elapsed: 0.009
sec - in org.apache.fop.fonts.type1.CharMetricsHandlerTestCase
Running org.apache.fop.fonts.type1.PostscriptParserTestCase
Tests run: 2, Failures: 0, Errors: 0, Skipped: 0, Time elapsed: 0.006
sec - in org.apache.fop.fonts.type1.PostscriptParserTestCase
Running org.apache.fop.fonts.type1.Type1FontLoaderTestCase
Tests run: 1, Failures: 0, Errors: 0, Skipped: 0, Time elapsed: 0.018
sec - in org.apache.fop.fonts.type1.Type1FontLoaderTestCase
Running org.apache.fop.fonts.type1.Type1SubsetFileTestCase
Tests run: 7, Failures: 0, Errors: 0, Skipped: 0, Time elapsed: 0.209
sec - in org.apache.fop.fonts.type1.Type1SubsetFileTestCase
Running org.apache.fop.fotreetest.FOTreeTestCase
Tests run: 41, Failures: 0, Errors: 0, Skipped: 0, Time elapsed: 0.391
sec - in org.apache.fop.fotreetest.FOTreeTestCase
Running org.apache.fop.HyphenationTestCase
Tests run: 3, Failures: 0, Errors: 0, Skipped: 0, Time elapsed: 0.05 sec
- in org.apache.fop.HyphenationTestCase
Running org.apache.fop.image.loader.batik.Graphics2DImagePainterImplTestCase
Tests run: 1, Failures: 0, Errors: 0, Skipped: 0, Time elapsed: 0.015
sec - in
org.apache.fop.image.loader.batik.Graphics2DImagePainterImplTestCase
Running org.apache.fop.image.loader.batik.ImageLoaderTestCase
Tests run: 1, Failures: 0, Errors: 0, Skipped: 1, Time elapsed: 0 sec -
in org.apache.fop.image.loader.batik.ImageLoaderTestCase
Running org.apache.fop.image.loader.batik.ImagePreloaderTestCase
Tests run: 5, Failures: 0, Errors: 0, Skipped: 1, Time elapsed: 0.224
sec - in org.apache.fop.image.loader.batik.ImagePreloaderTestCase
Running org.apache.fop.intermediate.AreaTreeParserTestCase
Tests run: 671, Failures: 0, Errors: 0, Skipped: 0, Time elapsed: 25.392
sec - in org.apache.fop.intermediate.AreaTreeParserTestCase
Running org.apache.fop.intermediate.IFMimickingTestCase
Tests run: 3, Failures: 0, Errors: 0, Skipped: 0, Time elapsed: 0.052
sec - in org.apache.fop.intermediate.IFMimickingTestCase
Running org.apache.fop.intermediate.IFParserTestCase
Tests run: 671, Failures: 0, Errors: 0, Skipped: 0, Time elapsed: 6.46
sec - in org.apache.fop.intermediate.IFParserTestCase
Running org.apache.fop.intermediate.IFTestCase
Tests run: 11, Failures: 0, Errors: 0, Skipped: 0, Time elapsed: 0.205
sec - in org.apache.fop.intermediate.IFTestCase
Running org.apache.fop.KnuthAlgorithmTestCase
Tests run: 1, Failures: 0, Errors: 0, Skipped: 0, Time elapsed: 0.01 sec
- in org.apache.fop.KnuthAlgorithmTestCase
Running org.apache.fop.layoutengine.HyphenationLayoutTestCase
Tests run: 13, Failures: 0, Errors: 0, Skipped: 0, Time elapsed: 0.567
sec - in org.apache.fop.layoutengine.HyphenationLayoutTestCase
Running org.apache.fop.layoutengine.LayoutEngineTestCase
Tests run: 671, Failures: 0, Errors: 0, Skipped: 0, Time elapsed: 13.335
sec - in org.apache.fop.layoutengine.LayoutEngineTestCase
Running org.apache.fop.layoutmgr.BreakElementTestCase
Tests run: 1, Failures: 0, Errors: 0, Skipped: 0, Time elapsed: 0.001
sec - in org.apache.fop.layoutmgr.BreakElementTestCase
Running org.apache.fop.layoutmgr.PageSequenceLayoutManagerTestCase
Tests run: 3, Failures: 0, Errors: 0, Skipped: 0, Time elapsed: 0.037
sec - in org.apache.fop.layoutmgr.PageSequenceLayoutManagerTestCase
Running
org.apache.fop.layoutmgr.RetrieveTableMarkerLayoutManagerMakerTestCase
Tests run: 1, Failures: 0, Errors: 0, Skipped: 0, Time elapsed: 0.002
sec - in
org.apache.fop.layoutmgr.RetrieveTableMarkerLayoutManagerMakerTestCase
Running org.apache.fop.layoutmgr.RetrieveTableMarkerLayoutManagerTestCase
Tests run: 1, Failures: 0, Errors: 0, Skipped: 0, Time elapsed: 0.033
sec - in org.apache.fop.layoutmgr.RetrieveTableMarkerLayoutManagerTestCase
Running org.apache.fop.layoutmgr.table.TableCellLayoutManagerTestCase
Tests run: 1, Failures: 0, Errors: 0, Skipped: 0, Time elapsed: 0.047
sec - in org.apache.fop.layoutmgr.table.TableCellLayoutManagerTestCase
Running org.apache.fop.layoutmgr.table.TableContentLayoutManagerTestCase
Tests run: 1, Failures: 0, Errors: 0, Skipped: 0, Time elapsed: 0.005
sec - in org.apache.fop.layoutmgr.table.TableContentLayoutManagerTestCase
Running org.apache.fop.layoutmgr.table.TableLayoutManagerTestCase
Tests run: 2, Failures: 0, Errors: 0, Skipped: 0, Time elapsed: 0.013
sec - in org.apache.fop.layoutmgr.table.TableLayoutManagerTestCase
Running org.apache.fop.pdf.AbstractPDFStreamTestCase
Tests run: 10, Failures: 0, Errors: 0, Skipped: 0, Time elapsed: 0 sec -
in org.apache.fop.pdf.AbstractPDFStreamTestCase
Running org.apache.fop.pdf.FileIDGeneratorTestCase
Tests run: 8, Failures: 0, Errors: 0, Skipped: 0, Time elapsed: 0 sec -
in org.apache.fop.pdf.FileIDGeneratorTestCase
Running org.apache.fop.pdf.ObjectStreamManagerTestCase
Tests run: 1, Failures: 0, Errors: 0, Skipped: 0, Time elapsed: 0.005
sec - in org.apache.fop.pdf.ObjectStreamManagerTestCase
Running org.apache.fop.pdf.ObjectStreamTestCase
Tests run: 4, Failures: 0, Errors: 0, Skipped: 0, Time elapsed: 0 sec -
in org.apache.fop.pdf.ObjectStreamTestCase
Running org.apache.fop.pdf.PDFAModeTestCase
Tests run: 6, Failures: 0, Errors: 0, Skipped: 0, Time elapsed: 0.004
sec - in org.apache.fop.pdf.PDFAModeTestCase
Running org.apache.fop.pdf.PDFArrayTestCase
Tests run: 15, Failures: 0, Errors: 0, Skipped: 0, Time elapsed: 0.001
sec - in org.apache.fop.pdf.PDFArrayTestCase
Running org.apache.fop.pdf.PDFAttachmentTestCase
Tests run: 3, Failures: 0, Errors: 0, Skipped: 0, Time elapsed: 0.018
sec - in org.apache.fop.pdf.PDFAttachmentTestCase
Running org.apache.fop.pdf.PDFDestsTestCase
Tests run: 10, Failures: 0, Errors: 0, Skipped: 0, Time elapsed: 0 sec -
in org.apache.fop.pdf.PDFDestsTestCase
Running org.apache.fop.pdf.PDFDictionaryTestCase
Tests run: 13, Failures: 0, Errors: 0, Skipped: 0, Time elapsed: 0 sec -
in org.apache.fop.pdf.PDFDictionaryTestCase
Running org.apache.fop.pdf.PDFDocumentGraphics2DTestCase
Tests run: 1, Failures: 0, Errors: 0, Skipped: 0, Time elapsed: 0.001
sec - in org.apache.fop.pdf.PDFDocumentGraphics2DTestCase
Running org.apache.fop.pdf.PDFDocumentTestCase
Tests run: 1, Failures: 0, Errors: 0, Skipped: 0, Time elapsed: 0 sec -
in org.apache.fop.pdf.PDFDocumentTestCase
Running org.apache.fop.pdf.PDFEncodingTestCase
Tests run: 4, Failures: 0, Errors: 0, Skipped: 0, Time elapsed: 0.004
sec - in org.apache.fop.pdf.PDFEncodingTestCase
Running org.apache.fop.pdf.PDFEncryptionJCETestCase
Tests run: 11, Failures: 0, Errors: 0, Skipped: 0, Time elapsed: 0.104
sec - in org.apache.fop.pdf.PDFEncryptionJCETestCase
Running org.apache.fop.pdf.PDFFactoryTestCase
Tests run: 5, Failures: 0, Errors: 0, Skipped: 0, Time elapsed: 0.022
sec - in org.apache.fop.pdf.PDFFactoryTestCase
Running org.apache.fop.pdf.PDFFileSpecTestCase
Tests run: 1, Failures: 0, Errors: 0, Skipped: 0, Time elapsed: 0 sec -
in org.apache.fop.pdf.PDFFileSpecTestCase
Running org.apache.fop.pdf.PDFFilterListTestCase
Tests run: 1, Failures: 0, Errors: 0, Skipped: 0, Time elapsed: 0 sec -
in org.apache.fop.pdf.PDFFilterListTestCase
Running org.apache.fop.pdf.PDFImageXObjectTestCase
Tests run: 2, Failures: 0, Errors: 0, Skipped: 0, Time elapsed: 0.033
sec - in org.apache.fop.pdf.PDFImageXObjectTestCase
Running org.apache.fop.pdf.PDFJavaScriptLaunchActionTestCase
Tests run: 1, Failures: 0, Errors: 0, Skipped: 0, Time elapsed: 0 sec -
in org.apache.fop.pdf.PDFJavaScriptLaunchActionTestCase
Running org.apache.fop.pdf.PDFLinearizationTestCase
Tests run: 2, Failures: 0, Errors: 0, Skipped: 0, Time elapsed: 0.036
sec - in org.apache.fop.pdf.PDFLinearizationTestCase
Running org.apache.fop.pdf.PDFLinkTestCase
Tests run: 181, Failures: 0, Errors: 0, Skipped: 0, Time elapsed: 0.207
sec - in org.apache.fop.pdf.PDFLinkTestCase
Running org.apache.fop.pdf.PDFNameTestCase
Tests run: 13, Failures: 0, Errors: 0, Skipped: 0, Time elapsed: 0 sec -
in org.apache.fop.pdf.PDFNameTestCase
Running org.apache.fop.pdf.PDFNullTestCase
Tests run: 10, Failures: 0, Errors: 0, Skipped: 0, Time elapsed: 0.001
sec - in org.apache.fop.pdf.PDFNullTestCase
Running org.apache.fop.pdf.PDFNumberTestCase
Tests run: 10, Failures: 0, Errors: 0, Skipped: 0, Time elapsed: 0 sec -
in org.apache.fop.pdf.PDFNumberTestCase
Running org.apache.fop.pdf.PDFNumsArrayTestCase
Tests run: 10, Failures: 0, Errors: 0, Skipped: 0, Time elapsed: 0 sec -
in org.apache.fop.pdf.PDFNumsArrayTestCase
Running org.apache.fop.pdf.PDFObjectTestCase
Tests run: 9, Failures: 0, Errors: 0, Skipped: 0, Time elapsed: 0 sec -
in org.apache.fop.pdf.PDFObjectTestCase
Running org.apache.fop.pdf.PDFPageLabelsTestCase
Tests run: 1, Failures: 0, Errors: 0, Skipped: 0, Time elapsed: 0 sec -
in org.apache.fop.pdf.PDFPageLabelsTestCase
Running org.apache.fop.pdf.PDFPagePieceTestCase
Tests run: 1, Failures: 0, Errors: 0, Skipped: 0, Time elapsed: 0.003
sec - in org.apache.fop.pdf.PDFPagePieceTestCase
Running org.apache.fop.pdf.PDFParentTreeTestCase
Tests run: 4, Failures: 0, Errors: 0, Skipped: 0, Time elapsed: 0.008
sec - in org.apache.fop.pdf.PDFParentTreeTestCase
Running org.apache.fop.pdf.PDFRectangleTestCase
Tests run: 1, Failures: 0, Errors: 0, Skipped: 0, Time elapsed: 0 sec -
in org.apache.fop.pdf.PDFRectangleTestCase
Running org.apache.fop.pdf.PDFReferenceTestCase
Tests run: 2, Failures: 0, Errors: 0, Skipped: 0, Time elapsed: 0 sec -
in org.apache.fop.pdf.PDFReferenceTestCase
Running org.apache.fop.pdf.PDFResourcesTestCase
Tests run: 3, Failures: 0, Errors: 0, Skipped: 0, Time elapsed: 0.017
sec - in org.apache.fop.pdf.PDFResourcesTestCase
Running org.apache.fop.pdf.PDFRootTestCase
Tests run: 1, Failures: 0, Errors: 0, Skipped: 0, Time elapsed: 0 sec -
in org.apache.fop.pdf.PDFRootTestCase
Running org.apache.fop.pdf.PDFStreamTestCase
Tests run: 6, Failures: 0, Errors: 0, Skipped: 0, Time elapsed: 0.001
sec - in org.apache.fop.pdf.PDFStreamTestCase
Running org.apache.fop.pdf.PDFUATestCase
Tests run: 2, Failures: 0, Errors: 0, Skipped: 0, Time elapsed: 0 sec -
in org.apache.fop.pdf.PDFUATestCase
Running org.apache.fop.pdf.PDFVTTestCase
Tests run: 4, Failures: 0, Errors: 0, Skipped: 0, Time elapsed: 0.261
sec - in org.apache.fop.pdf.PDFVTTestCase
Running org.apache.fop.pdf.TableHeaderScopeTestCase
Tests run: 3, Failures: 0, Errors: 0, Skipped: 0, Time elapsed: 0.016
sec - in org.apache.fop.pdf.TableHeaderScopeTestCase
Running org.apache.fop.pdf.VersionControllerTestCase
Tests run: 2, Failures: 0, Errors: 0, Skipped: 0, Time elapsed: 0 sec -
in org.apache.fop.pdf.VersionControllerTestCase
Running org.apache.fop.pdf.VersionTestCase
Tests run: 4, Failures: 0, Errors: 0, Skipped: 0, Time elapsed: 0 sec -
in org.apache.fop.pdf.VersionTestCase
Running org.apache.fop.pdf.xref.CompressedObjectReferenceTestCase
Tests run: 1, Failures: 0, Errors: 0, Skipped: 0, Time elapsed: 0 sec -
in org.apache.fop.pdf.xref.CompressedObjectReferenceTestCase
Running org.apache.fop.pdf.xref.CrossReferenceStreamTestCase
Tests run: 5, Failures: 0, Errors: 0, Skipped: 0, Time elapsed: 0.005
sec - in org.apache.fop.pdf.xref.CrossReferenceStreamTestCase
Running org.apache.fop.pdf.xref.CrossReferenceTableTestCase
Tests run: 3, Failures: 0, Errors: 0, Skipped: 0, Time elapsed: 0 sec -
in org.apache.fop.pdf.xref.CrossReferenceTableTestCase
Running org.apache.fop.pdf.xref.UncompressedObjectReferenceTestCase
Tests run: 6, Failures: 0, Errors: 0, Skipped: 0, Time elapsed: 0.001
sec - in org.apache.fop.pdf.xref.UncompressedObjectReferenceTestCase
Running org.apache.fop.render.AbstractPathOrientedRendererTestCase
Tests run: 1, Failures: 0, Errors: 0, Skipped: 0, Time elapsed: 0.005
sec - in org.apache.fop.render.AbstractPathOrientedRendererTestCase
Running org.apache.fop.render.afp.AFPBorderPainterTestCase
Tests run: 2, Failures: 0, Errors: 0, Skipped: 0, Time elapsed: 0 sec -
in org.apache.fop.render.afp.AFPBorderPainterTestCase
Running org.apache.fop.render.afp.AFPImageHandlerGraphics2DTestCase
Tests run: 1, Failures: 0, Errors: 0, Skipped: 0, Time elapsed: 0.006
sec - in org.apache.fop.render.afp.AFPImageHandlerGraphics2DTestCase
Running org.apache.fop.render.afp.AFPImageHandlerTestCase
Tests run: 1, Failures: 0, Errors: 0, Skipped: 0, Time elapsed: 0 sec -
in org.apache.fop.render.afp.AFPImageHandlerTestCase
Running org.apache.fop.render.afp.AFPPainterTestCase
Tests run: 4, Failures: 0, Errors: 0, Skipped: 0, Time elapsed: 6.205
sec - in org.apache.fop.render.afp.AFPPainterTestCase
Running org.apache.fop.render.afp.AFPRendererConfigParserTestCase
Tests run: 15, Failures: 0, Errors: 0, Skipped: 0, Time elapsed: 0.044
sec - in org.apache.fop.render.afp.AFPRendererConfigParserTestCase
Running org.apache.fop.render.afp.AFPRendererConfiguratorTestCase
Tests run: 18, Failures: 0, Errors: 0, Skipped: 0, Time elapsed: 0.062
sec - in org.apache.fop.render.afp.AFPRendererConfiguratorTestCase
Running org.apache.fop.render.afp.AFPTrueTypeTestCase
Tests run: 3, Failures: 0, Errors: 0, Skipped: 0, Time elapsed: 0.126
sec - in org.apache.fop.render.afp.AFPTrueTypeTestCase
Running org.apache.fop.render.afp.NoOperationTestCase
Tests run: 1, Failures: 0, Errors: 0, Skipped: 0, Time elapsed: 0.028
sec - in org.apache.fop.render.afp.NoOperationTestCase
Running org.apache.fop.render.bitmap.BitmapRendererConfigParserTestCase
Tests run: 5, Failures: 0, Errors: 0, Skipped: 0, Time elapsed: 0.02 sec
- in org.apache.fop.render.bitmap.BitmapRendererConfigParserTestCase
Running org.apache.fop.render.bitmap.BitmapRendererConfiguratorTestCase
Tests run: 5, Failures: 0, Errors: 0, Skipped: 0, Time elapsed: 0.018
sec - in org.apache.fop.render.bitmap.BitmapRendererConfiguratorTestCase
Running org.apache.fop.render.bitmap.TIFFCompressionValueTestCase
Tests run: 3, Failures: 0, Errors: 0, Skipped: 0, Time elapsed: 0 sec -
in org.apache.fop.render.bitmap.TIFFCompressionValueTestCase
Running org.apache.fop.render.bitmap.TIFFRendererConfigParserTestCase
Tests run: 8, Failures: 0, Errors: 0, Skipped: 0, Time elapsed: 0.024
sec - in org.apache.fop.render.bitmap.TIFFRendererConfigParserTestCase
Running org.apache.fop.render.bitmap.TIFFRendererConfiguratorTestCase
Tests run: 7, Failures: 0, Errors: 0, Skipped: 0, Time elapsed: 0.025
sec - in org.apache.fop.render.bitmap.TIFFRendererConfiguratorTestCase
Running org.apache.fop.render.ConserveMemoryTestCase
Tests run: 1, Failures: 0, Errors: 0, Skipped: 0, Time elapsed: 0.062
sec - in org.apache.fop.render.ConserveMemoryTestCase
Running org.apache.fop.render.extensions.DocumentNavigationHandlerTestCase
Tests run: 4, Failures: 0, Errors: 0, Skipped: 0, Time elapsed: 0.025
sec - in org.apache.fop.render.extensions.DocumentNavigationHandlerTestCase
Running org.apache.fop.render.extensions.prepress.PageBoundariesTestCase
Tests run: 8, Failures: 0, Errors: 0, Skipped: 0, Time elapsed: 0 sec -
in org.apache.fop.render.extensions.prepress.PageBoundariesTestCase
Running org.apache.fop.render.extensions.prepress.PageScaleTestCase
Tests run: 4, Failures: 0, Errors: 0, Skipped: 0, Time elapsed: 0 sec -
in org.apache.fop.render.extensions.prepress.PageScaleTestCase
Running org.apache.fop.render.gradient.GradientTestCase
Tests run: 6, Failures: 0, Errors: 0, Skipped: 0, Time elapsed: 0.023
sec - in org.apache.fop.render.gradient.GradientTestCase
Running org.apache.fop.render.intermediate.AbstractIFPainterTestCase
Tests run: 2, Failures: 0, Errors: 0, Skipped: 0, Time elapsed: 0.008
sec - in org.apache.fop.render.intermediate.AbstractIFPainterTestCase
Running
org.apache.fop.render.intermediate.ArcToBezierCurveTransformerTestCase
Tests run: 1, Failures: 0, Errors: 0, Skipped: 0, Time elapsed: 0.001
sec - in
org.apache.fop.render.intermediate.ArcToBezierCurveTransformerTestCase
Running org.apache.fop.render.intermediate.BorderPainterTestCase
Tests run: 7, Failures: 0, Errors: 0, Skipped: 0, Time elapsed: 0.079
sec - in org.apache.fop.render.intermediate.BorderPainterTestCase
Running org.apache.fop.render.intermediate.IFRendererTestCase
Tests run: 1, Failures: 0, Errors: 0, Skipped: 0, Time elapsed: 0.062
sec - in org.apache.fop.render.intermediate.IFRendererTestCase
Running org.apache.fop.render.intermediate.IFSerializerTestCase
Tests run: 3, Failures: 0, Errors: 0, Skipped: 0, Time elapsed: 0.003
sec - in org.apache.fop.render.intermediate.IFSerializerTestCase
Running org.apache.fop.render.intermediate.IFStructureTreeBuilderTestCase
Tests run: 4, Failures: 0, Errors: 0, Skipped: 0, Time elapsed: 0.015
sec - in org.apache.fop.render.intermediate.IFStructureTreeBuilderTestCase
Running org.apache.fop.render.intermediate.SAXEventRecorderTestCase
Tests run: 5, Failures: 0, Errors: 0, Skipped: 0, Time elapsed: 0.001
sec - in org.apache.fop.render.intermediate.SAXEventRecorderTestCase
Running org.apache.fop.render.intermediate.URIActionTestCase
Tests run: 1, Failures: 0, Errors: 0, Skipped: 0, Time elapsed: 0 sec -
in org.apache.fop.render.intermediate.URIActionTestCase
Running org.apache.fop.render.java2d.ConfiguredFontCollectionTestCase
Tests run: 1, Failures: 0, Errors: 0, Skipped: 0, Time elapsed: 0.021
sec - in org.apache.fop.render.java2d.ConfiguredFontCollectionTestCase
Running org.apache.fop.render.java2d.Java2DUtilTestCase
Tests run: 2, Failures: 0, Errors: 0, Skipped: 0, Time elapsed: 0.028
sec - in org.apache.fop.render.java2d.Java2DUtilTestCase
Running org.apache.fop.render.pcl.fonts.PCLByteWriterUtilTestCase
Tests run: 2, Failures: 0, Errors: 0, Skipped: 0, Time elapsed: 0 sec -
in org.apache.fop.render.pcl.fonts.PCLByteWriterUtilTestCase
Running org.apache.fop.render.pcl.fonts.PCLFontReaderFactoryTestCase
Tests run: 1, Failures: 0, Errors: 0, Skipped: 0, Time elapsed: 0.083
sec - in org.apache.fop.render.pcl.fonts.PCLFontReaderFactoryTestCase
Running org.apache.fop.render.pcl.fonts.PCLTTFFontReaderTestCase
Tests run: 1, Failures: 0, Errors: 0, Skipped: 0, Time elapsed: 0.015
sec - in org.apache.fop.render.pcl.fonts.PCLTTFFontReaderTestCase
Running
org.apache.fop.render.pcl.fonts.truetype.PCLTTFCharacterWriterTestCase
Tests run: 1, Failures: 0, Errors: 0, Skipped: 0, Time elapsed: 0.026
sec - in
org.apache.fop.render.pcl.fonts.truetype.PCLTTFCharacterWriterTestCase
Running org.apache.fop.render.pcl.PCLPainterTestCase
Tests run: 2, Failures: 0, Errors: 0, Skipped: 0, Time elapsed: 0.08 sec
- in org.apache.fop.render.pcl.PCLPainterTestCase
Running org.apache.fop.render.pcl.PCLRendererConfigParserTestCase
Tests run: 6, Failures: 0, Errors: 0, Skipped: 0, Time elapsed: 0.008
sec - in org.apache.fop.render.pcl.PCLRendererConfigParserTestCase
Running org.apache.fop.render.pcl.PCLRendererConfiguratorTestCase
Tests run: 5, Failures: 0, Errors: 0, Skipped: 0, Time elapsed: 0.014
sec - in org.apache.fop.render.pcl.PCLRendererConfiguratorTestCase
Running
org.apache.fop.render.pdf.extensions.PDFDocumentInformationElementTestCase
Tests run: 2, Failures: 0, Errors: 0, Skipped: 0, Time elapsed: 0.017
sec - in
org.apache.fop.render.pdf.extensions.PDFDocumentInformationElementTestCase
Running org.apache.fop.render.pdf.ImageRawPNGAdapterTestCase
Tests run: 9, Failures: 0, Errors: 0, Skipped: 0, Time elapsed: 0.038
sec - in org.apache.fop.render.pdf.ImageRawPNGAdapterTestCase
Running org.apache.fop.render.pdf.ImageRenderedAdapterTestCase
Tests run: 3, Failures: 0, Errors: 0, Skipped: 0, Time elapsed: 0.006
sec - in org.apache.fop.render.pdf.ImageRenderedAdapterTestCase
Running org.apache.fop.render.pdf.PDFAConformanceTestCase
Tests run: 7, Failures: 0, Errors: 0, Skipped: 0, Time elapsed: 0.097
sec - in org.apache.fop.render.pdf.PDFAConformanceTestCase
Running org.apache.fop.render.pdf.PDFAMetadataTestCase
Tests run: 2, Failures: 0, Errors: 0, Skipped: 0, Time elapsed: 0.001
sec - in org.apache.fop.render.pdf.PDFAMetadataTestCase
Running org.apache.fop.render.pdf.PDFBorderPainterTestCase
Tests run: 1, Failures: 0, Errors: 0, Skipped: 0, Time elapsed: 0 sec -
in org.apache.fop.render.pdf.PDFBorderPainterTestCase
Running org.apache.fop.render.pdf.PDFCMapTestCase
Tests run: 1, Failures: 0, Errors: 0, Skipped: 0, Time elapsed: 0 sec -
in org.apache.fop.render.pdf.PDFCMapTestCase
Running org.apache.fop.render.pdf.PDFDocumentHandlerTestCase
Tests run: 1, Failures: 0, Errors: 0, Skipped: 0, Time elapsed: 0 sec -
in org.apache.fop.render.pdf.PDFDocumentHandlerTestCase
Running org.apache.fop.render.pdf.PDFEncodingTestCase
Tests run: 3, Failures: 0, Errors: 0, Skipped: 0, Time elapsed: 0.526
sec - in org.apache.fop.render.pdf.PDFEncodingTestCase
Running org.apache.fop.render.pdf.PDFGraphicsPainterTestCase
Tests run: 12, Failures: 0, Errors: 0, Skipped: 0, Time elapsed: 0.011
sec - in org.apache.fop.render.pdf.PDFGraphicsPainterTestCase
Running org.apache.fop.render.pdf.PDFPainterTestCase
Tests run: 5, Failures: 0, Errors: 0, Skipped: 0, Time elapsed: 0.092
sec - in org.apache.fop.render.pdf.PDFPainterTestCase
Running org.apache.fop.render.pdf.PDFRendererConfigParserTestCase
Tests run: 13, Failures: 0, Errors: 0, Skipped: 0, Time elapsed: 0.202
sec - in org.apache.fop.render.pdf.PDFRendererConfigParserTestCase
Running org.apache.fop.render.pdf.PDFRendererConfiguratorTestCase
Tests run: 1, Failures: 0, Errors: 0, Skipped: 0, Time elapsed: 0.001
sec - in org.apache.fop.render.pdf.PDFRendererConfiguratorTestCase
Running org.apache.fop.render.pdf.PDFRendererOptionsConfigTestCase
Tests run: 3, Failures: 0, Errors: 0, Skipped: 0, Time elapsed: 0 sec -
in org.apache.fop.render.pdf.PDFRendererOptionsConfigTestCase
Running org.apache.fop.render.pdf.PDFsRGBSettingsTestCase
Tests run: 1, Failures: 0, Errors: 0, Skipped: 0, Time elapsed: 0.001
sec - in org.apache.fop.render.pdf.PDFsRGBSettingsTestCase
Running org.apache.fop.render.pdf.PDFStructureTreeBuilderTestCase
Tests run: 1, Failures: 0, Errors: 0, Skipped: 0, Time elapsed: 0 sec -
in org.apache.fop.render.pdf.PDFStructureTreeBuilderTestCase
Running org.apache.fop.render.ps.fonts.PSTTFGeneratorTestCase
Tests run: 4, Failures: 0, Errors: 0, Skipped: 0, Time elapsed: 0.008
sec - in org.apache.fop.render.ps.fonts.PSTTFGeneratorTestCase
Running org.apache.fop.render.ps.fonts.PSTTFGlyphOutputStreamTestCase
Tests run: 3, Failures: 0, Errors: 0, Skipped: 0, Time elapsed: 0.209
sec - in org.apache.fop.render.ps.fonts.PSTTFGlyphOutputStreamTestCase
Running org.apache.fop.render.ps.fonts.PSTTFOutputStreamTestCase
Tests run: 4, Failures: 0, Errors: 0, Skipped: 0, Time elapsed: 0.006
sec - in org.apache.fop.render.ps.fonts.PSTTFOutputStreamTestCase
Running org.apache.fop.render.ps.fonts.PSTTFTableOutputStreamTestCase
Tests run: 1, Failures: 0, Errors: 0, Skipped: 0, Time elapsed: 0.001
sec - in org.apache.fop.render.ps.fonts.PSTTFTableOutputStreamTestCase
Running org.apache.fop.render.ps.ImageEncoderPNGTestCase
Tests run: 7, Failures: 0, Errors: 0, Skipped: 0, Time elapsed: 0.004
sec - in org.apache.fop.render.ps.ImageEncoderPNGTestCase
Running org.apache.fop.render.ps.ImageHandlingTestCase
Tests run: 3, Failures: 0, Errors: 0, Skipped: 0, Time elapsed: 0.14 sec
- in org.apache.fop.render.ps.ImageHandlingTestCase
Running org.apache.fop.render.ps.PSBorderPainterTestCase
Tests run: 1, Failures: 0, Errors: 0, Skipped: 0, Time elapsed: 0 sec -
in org.apache.fop.render.ps.PSBorderPainterTestCase
Running org.apache.fop.render.ps.PSGraphics2DAdapterTestCase
Tests run: 1, Failures: 0, Errors: 0, Skipped: 0, Time elapsed: 0.005
sec - in org.apache.fop.render.ps.PSGraphics2DAdapterTestCase
Running org.apache.fop.render.ps.PSGraphicsPainterTestCase
Tests run: 1, Failures: 0, Errors: 0, Skipped: 0, Time elapsed: 0 sec -
in org.apache.fop.render.ps.PSGraphicsPainterTestCase
Running org.apache.fop.render.ps.PSImageUtilsTestCase
Tests run: 1, Failures: 0, Errors: 0, Skipped: 1, Time elapsed: 0.001
sec - in org.apache.fop.render.ps.PSImageUtilsTestCase
Running org.apache.fop.render.ps.PSPainterTestCase
Tests run: 5, Failures: 0, Errors: 0, Skipped: 0, Time elapsed: 0.03 sec
- in org.apache.fop.render.ps.PSPainterTestCase
Running org.apache.fop.render.ps.PSRendererConfigParserTestCase
Tests run: 5, Failures: 0, Errors: 0, Skipped: 0, Time elapsed: 0.008
sec - in org.apache.fop.render.ps.PSRendererConfigParserTestCase
Running org.apache.fop.render.ps.PSRendererConfiguratorTestCase
Tests run: 6, Failures: 0, Errors: 0, Skipped: 0, Time elapsed: 0.013
sec - in org.apache.fop.render.ps.PSRendererConfiguratorTestCase
Running org.apache.fop.render.ps.PSRenderingUtilTestCase
Tests run: 1, Failures: 0, Errors: 0, Skipped: 0, Time elapsed: 0 sec -
in org.apache.fop.render.ps.PSRenderingUtilTestCase
Running org.apache.fop.render.ps.ResourceOptimizationTestCase
Tests run: 1, Failures: 0, Errors: 0, Skipped: 0, Time elapsed: 0.041
sec - in org.apache.fop.render.ps.ResourceOptimizationTestCase
Running org.apache.fop.render.ps.svg.GradientTestCase
Tests run: 2, Failures: 2, Errors: 0, Skipped: 0, Time elapsed: 0.029
sec <<< FAILURE! - in org.apache.fop.render.ps.svg.GradientTestCase
testRadialGradient(org.apache.fop.render.ps.svg.GradientTestCase) Time
elapsed: 0.024 sec  <<< FAILURE!
org.junit.ComparisonFailure: expected:<...attern setcolorspace[
<<
/Type /Pattern
/PatternType 2
/Shading <<
/ShadingType 3
/ColorSpace /DeviceRGB
/Coords [ 840 180 0 840 180 16 ]
/Extend [ true true ]
/Function <<
/FunctionType 3
/Domain [ 0 1 ]
/Functions [ <<
/FunctionType 2
/Domain [ 0 1 ]
/C0 [ 1 1 1 ]
/C1 [ 1 1 1 ]
/N 1
 >> <<
/FunctionType 2
/Domain [ 0 1 ]
/C0 [ 1 1 1 ]
/C1 [ 0.784 0.784 0.784 ]
/N 1
 >> <<
/FunctionType 2
/Domain [ 0 1 ]
/C0 [ 0.784 0.784 0.784 ]
/C1 [ 0.667 0.667 0.667 ]
/N 1
 >> <<
/FunctionType 2
/Domain [ 0 1 ]
/C0 [ 0.667 0.667 0.667 ]
/C1 [ 0.549 0.549 0.549 ]
/N 1
 >> ]
/Encode [ 0 1 0 1 0 1 0 1 ]
/Bounds [ 0.2 0.6 0.8 ]
 >>
 >>
 >>
[ 1 0 0 1 0 0 ] makepattern setcolor
]
 > but was:<...attern setcolorspace[
<<
/Type /Pattern
/PatternType 2
/Shading <<
/ShadingType 3
/ColorSpace /DeviceRGB
/Coords [ 840 180 0 840 180 16 ]
/Extend [ true true ]
/Function <<
/FunctionType 3
/Domain [ 0 1 ]
/Functions [ <<
/FunctionType 2
/Domain [ 0 1 ]
/C0 [ 1 1 1 ]
/C1 [ 1 1 1 ]
/N 1
 >> <<
/FunctionType 2
/Domain [ 0 1 ]
/C0 [ 1 1 1 ]
/C1 [ 0.784 0.784 0.784 ]
/N 1
 >> <<
/FunctionType 2
/Domain [ 0 1 ]
/C0 [ 0.784 0.784 0.784 ]
/C1 [ 0.667 0.667 0.667 ]
/N 1
 >> <<
/FunctionType 2
/Domain [ 0 1 ]
/C0 [ 0.667 0.667 0.667 ]
/C1 [ 0.549 0.549 0.549 ]
/N 1
 >> ]
/Encode [ 0 1 0 1 0 1 0 1 ]
/Bounds [ 0.2 0.6 0.8 ]
 >>
 >>
 >>
[ 1 0 0 1 0 0 ] makepattern setcolor]
 >
     at org.junit.Assert.assertEquals(Assert.java:115)
     at org.junit.Assert.assertEquals(Assert.java:144)
     at
org.apache.fop.render.ps.svg.GradientTestCase.testGradientRendering(GradientTestCase.java:73)
     at
org.apache.fop.render.ps.svg.GradientTestCase.testRadialGradient(GradientTestCase.java:61)

testLinearGradient(org.apache.fop.render.ps.svg.GradientTestCase) Time
elapsed: 0.004 sec  <<< FAILURE!
org.junit.ComparisonFailure: expected:<...attern setcolorspace[
<<
/Type /Pattern
/PatternType 2
/Shading <<
/ShadingType 2
/ColorSpace /DeviceRGB
/Coords [ 115 285 15 15 ]
/Extend [ true true ]
/Function <<
/FunctionType 3
/Domain [ 0 1 ]
/Functions [ <<
/FunctionType 2
/Domain [ 0 1 ]
/C0 [ 1 1 0 ]
/C1 [ 1 0 0 ]
/N 1
 >> ]
/Encode [ 0 1 ]
/Bounds [ ]
 >>
 >>
 >>
[ 1 0 0 1 0 0 ] makepattern setcolor
]
 > but was:<...attern setcolorspace[
<<
/Type /Pattern
/PatternType 2
/Shading <<
/ShadingType 2
/ColorSpace /DeviceRGB
/Coords [ 115 285 15 15 ]
/Extend [ true true ]
/Function <<
/FunctionType 3
/Domain [ 0 1 ]
/Functions [ <<
/FunctionType 2
/Domain [ 0 1 ]
/C0 [ 1 1 0 ]
/C1 [ 1 0 0 ]
/N 1
 >> ]
/Encode [ 0 1 ]
/Bounds [ ]
 >>
 >>
 >>
[ 1 0 0 1 0 0 ] makepattern setcolor]
 >
     at org.junit.Assert.assertEquals(Assert.java:115)
     at org.junit.Assert.assertEquals(Assert.java:144)
     at
org.apache.fop.render.ps.svg.GradientTestCase.testGradientRendering(GradientTestCase.java:73)
     at
org.apache.fop.render.ps.svg.GradientTestCase.testLinearGradient(GradientTestCase.java:46)

Running org.apache.fop.render.RendererFactoryTestCase
Tests run: 3, Failures: 0, Errors: 0, Skipped: 0, Time elapsed: 0.001
sec - in org.apache.fop.render.RendererFactoryTestCase
Running org.apache.fop.render.rtf.Bug39607TestCase
Tests run: 1, Failures: 0, Errors: 0, Skipped: 0, Time elapsed: 0.007
sec - in org.apache.fop.render.rtf.Bug39607TestCase
Running org.apache.fop.render.rtf.TextAttributesConverterTestCase
Tests run: 1, Failures: 0, Errors: 0, Skipped: 0, Time elapsed: 0 sec -
in org.apache.fop.render.rtf.TextAttributesConverterTestCase
Running org.apache.fop.render.txt.TxtRendererConfigParserTestCase
Tests run: 1, Failures: 0, Errors: 0, Skipped: 0, Time elapsed: 0.002
sec - in org.apache.fop.render.txt.TxtRendererConfigParserTestCase
Running org.apache.fop.svg.font.BasicGlyphVectorTestCase
Tests run: 12, Failures: 0, Errors: 0, Skipped: 0, Time elapsed: 0.038
sec - in org.apache.fop.svg.font.BasicGlyphVectorTestCase
Running org.apache.fop.svg.font.FOPFontFamilyResolverTestCase
Tests run: 4, Failures: 0, Errors: 0, Skipped: 1, Time elapsed: 0.011
sec - in org.apache.fop.svg.font.FOPFontFamilyResolverTestCase
Running org.apache.fop.svg.font.FOPGVTFontTestCase
Tests run: 2, Failures: 0, Errors: 0, Skipped: 0, Time elapsed: 0.001
sec - in org.apache.fop.svg.font.FOPGVTFontTestCase
Running org.apache.fop.svg.font.GlyphLayoutTestCase
Tests run: 2, Failures: 0, Errors: 0, Skipped: 0, Time elapsed: 0.016
sec - in org.apache.fop.svg.font.GlyphLayoutTestCase
Running org.apache.fop.svg.font.KerningGlyphLayoutTestCase
Tests run: 1, Failures: 0, Errors: 0, Skipped: 0, Time elapsed: 0.002
sec - in org.apache.fop.svg.font.KerningGlyphLayoutTestCase
Running org.apache.fop.svg.PDFGraphics2DTestCase
Tests run: 2, Failures: 0, Errors: 0, Skipped: 0, Time elapsed: 0.001
sec - in org.apache.fop.svg.PDFGraphics2DTestCase
Running org.apache.fop.svg.PDFTextPainterTestCase
Tests run: 5, Failures: 0, Errors: 0, Skipped: 0, Time elapsed: 0.067
sec - in org.apache.fop.svg.PDFTextPainterTestCase
Running org.apache.fop.svg.PSTextPainterTestCase
Tests run: 1, Failures: 0, Errors: 0, Skipped: 0, Time elapsed: 0.009
sec - in org.apache.fop.svg.PSTextPainterTestCase
Running org.apache.fop.text.linebreak.LineBreakStatusTestCase
Tests run: 2, Failures: 0, Errors: 0, Skipped: 0, Time elapsed: 0 sec -
in org.apache.fop.text.linebreak.LineBreakStatusTestCase
Running org.apache.fop.text.linebreak.LineBreakUtilsTestCase
Tests run: 2, Failures: 0, Errors: 0, Skipped: 0, Time elapsed: 0.001
sec - in org.apache.fop.text.linebreak.LineBreakUtilsTestCase
Running org.apache.fop.traits.BorderPropsTestCase
Tests run: 2, Failures: 0, Errors: 0, Skipped: 0, Time elapsed: 0 sec -
in org.apache.fop.traits.BorderPropsTestCase
Running org.apache.fop.traits.MinOptMaxTestCase
Tests run: 20, Failures: 0, Errors: 0, Skipped: 0, Time elapsed: 0.001
sec - in org.apache.fop.traits.MinOptMaxTestCase
Running org.apache.fop.URIResolutionTestCase
Tests run: 2, Failures: 0, Errors: 0, Skipped: 0, Time elapsed: 0.023
sec - in org.apache.fop.URIResolutionTestCase
Running org.apache.fop.util.AdvancedMessageFormatTestCase
Tests run: 5, Failures: 0, Errors: 0, Skipped: 0, Time elapsed: 0.007
sec - in org.apache.fop.util.AdvancedMessageFormatTestCase
Running org.apache.fop.util.BitmapImageUtilTestCase
Tests run: 1, Failures: 0, Errors: 0, Skipped: 0, Time elapsed: 0.501
sec - in org.apache.fop.util.BitmapImageUtilTestCase
Running org.apache.fop.util.CharUtilitiesTestCase
Tests run: 5, Failures: 0, Errors: 0, Skipped: 0, Time elapsed: 0.043
sec - in org.apache.fop.util.CharUtilitiesTestCase
Running org.apache.fop.util.ColorUtilTestCase
Tests run: 8, Failures: 0, Errors: 0, Skipped: 0, Time elapsed: 0.047
sec - in org.apache.fop.util.ColorUtilTestCase
Running org.apache.fop.util.CompareUtilTestCase
Tests run: 1, Failures: 0, Errors: 0, Skipped: 0, Time elapsed: 0.014
sec - in org.apache.fop.util.CompareUtilTestCase
Running org.apache.fop.util.ElementListUtilsTestCase
Tests run: 4, Failures: 0, Errors: 0, Skipped: 0, Time elapsed: 0 sec -
in org.apache.fop.util.ElementListUtilsTestCase
Running org.apache.fop.util.HexEncoderTestCase
Tests run: 2, Failures: 0, Errors: 0, Skipped: 0, Time elapsed: 0.021
sec - in org.apache.fop.util.HexEncoderTestCase
Running org.apache.fop.util.LanguageTagsTestCase
Tests run: 4, Failures: 0, Errors: 0, Skipped: 0, Time elapsed: 0 sec -
in org.apache.fop.util.LanguageTagsTestCase
Running org.apache.fop.util.XMLResourceBundleTestCase
Tests run: 2, Failures: 0, Errors: 0, Skipped: 0, Time elapsed: 0 sec -
in org.apache.fop.util.XMLResourceBundleTestCase

Results :

Failed tests:
FO2StructureTreeConverterTestCase.testRemoveBlocks:142->compare:183
expected:<...cture-tree-sequence>[
<structure-tree xmlns="http://xmlgraphics.apache.org/fop/intermediate"
xmlns:foi="http://xmlgraphics.apache.org/fop/internal"
xmlns:fox="http://xmlgraphics.apache.org/fop/extensions">
<fo:flow xmlns:fo="http://www.w3.org/1999/XSL/Format"
flow-name="xsl-region-body">
<fo:block>
<marked-content/>
</fo:block>
</fo:flow>
</structure-tree>
</structure-tree-sequence>]
 > but was:<...cture-tree-sequence>[
<structure-tree xmlns="http://xmlgraphics.apache.org/fop/intermediate"
xmlns:foi="http://xmlgraphics.apache.org/fop/internal"
xmlns:fox="http://xmlgraphics.apache.org/fop/extensions">
<fo:flow xmlns:fo="http://www.w3.org/1999/XSL/Format"
flow-name="xsl-region-body">
<fo:block>
<marked-content/>
</fo:block>
</fo:flow>
</structure-tree>
</structure-tree-sequence>
]
 >
GradientTestCase.testLinearGradient:46->testGradientRendering:73
expected:<...attern setcolorspace[
<<
/Type /Pattern
/PatternType 2
/Shading <<
/ShadingType 2
/ColorSpace /DeviceRGB
/Coords [ 115 285 15 15 ]
/Extend [ true true ]
/Function <<
/FunctionType 3
/Domain [ 0 1 ]
/Functions [ <<
/FunctionType 2
/Domain [ 0 1 ]
/C0 [ 1 1 0 ]
/C1 [ 1 0 0 ]
/N 1
 >> ]
/Encode [ 0 1 ]
/Bounds [ ]
 >>
 >>
 >>
[ 1 0 0 1 0 0 ] makepattern setcolor
]
 > but was:<...attern setcolorspace[
<<
/Type /Pattern
/PatternType 2
/Shading <<
/ShadingType 2
/ColorSpace /DeviceRGB
/Coords [ 115 285 15 15 ]
/Extend [ true true ]
/Function <<
/FunctionType 3
/Domain [ 0 1 ]
/Functions [ <<
/FunctionType 2
/Domain [ 0 1 ]
/C0 [ 1 1 0 ]
/C1 [ 1 0 0 ]
/N 1
 >> ]
/Encode [ 0 1 ]
/Bounds [ ]
 >>
 >>
 >>
[ 1 0 0 1 0 0 ] makepattern setcolor]
 >
GradientTestCase.testRadialGradient:61->testGradientRendering:73
expected:<...attern setcolorspace[
<<
/Type /Pattern
/PatternType 2
/Shading <<
/ShadingType 3
/ColorSpace /DeviceRGB
/Coords [ 840 180 0 840 180 16 ]
/Extend [ true true ]
/Function <<
/FunctionType 3
/Domain [ 0 1 ]
/Functions [ <<
/FunctionType 2
/Domain [ 0 1 ]
/C0 [ 1 1 1 ]
/C1 [ 1 1 1 ]
/N 1
 >> <<
/FunctionType 2
/Domain [ 0 1 ]
/C0 [ 1 1 1 ]
/C1 [ 0.784 0.784 0.784 ]
/N 1
 >> <<
/FunctionType 2
/Domain [ 0 1 ]
/C0 [ 0.784 0.784 0.784 ]
/C1 [ 0.667 0.667 0.667 ]
/N 1
 >> <<
/FunctionType 2
/Domain [ 0 1 ]
/C0 [ 0.667 0.667 0.667 ]
/C1 [ 0.549 0.549 0.549 ]
/N 1
 >> ]
/Encode [ 0 1 0 1 0 1 0 1 ]
/Bounds [ 0.2 0.6 0.8 ]
 >>
 >>
 >>
[ 1 0 0 1 0 0 ] makepattern setcolor
]
 > but was:<...attern setcolorspace[
<<
/Type /Pattern
/PatternType 2
/Shading <<
/ShadingType 3
/ColorSpace /DeviceRGB
/Coords [ 840 180 0 840 180 16 ]
/Extend [ true true ]
/Function <<
/FunctionType 3
/Domain [ 0 1 ]
/Functions [ <<
/FunctionType 2
/Domain [ 0 1 ]
/C0 [ 1 1 1 ]
/C1 [ 1 1 1 ]
/N 1
 >> <<
/FunctionType 2
/Domain [ 0 1 ]
/C0 [ 1 1 1 ]
/C1 [ 0.784 0.784 0.784 ]
/N 1
 >> <<
/FunctionType 2
/Domain [ 0 1 ]
/C0 [ 0.784 0.784 0.784 ]
/C1 [ 0.667 0.667 0.667 ]
/N 1
 >> <<
/FunctionType 2
/Domain [ 0 1 ]
/C0 [ 0.667 0.667 0.667 ]
/C1 [ 0.549 0.549 0.549 ]
/N 1
 >> ]
/Encode [ 0 1 0 1 0 1 0 1 ]
/Bounds [ 0.2 0.6 0.8 ]
 >>
 >>
 >>
[ 1 0 0 1 0 0 ] makepattern setcolor]
 >

Tests run: 3214, Failures: 3, Errors: 0, Skipped: 4

[INFO]
------------------------------------------------------------------------
[INFO] Reactor Summary for Apache FOP Parent 2.5.0-SNAPSHOT:
[INFO]
[INFO] Apache FOP Parent .................................. SUCCESS [ 
0.291 s]
[INFO] Apache FOP Utilities ............................... SUCCESS [ 
1.297 s]
[INFO] Apache FOP Events .................................. SUCCESS [ 
1.223 s]
[INFO] Apache FOP Core .................................... FAILURE
[01:57 min]
[INFO] Apache FOP All-In-One .............................. SKIPPED
[INFO] Apache FOP Sandbox ................................. SKIPPED
[INFO] Apache FOP Servlet ................................. SKIPPED
[INFO] Apache FOP Transcoder .............................. SKIPPED
[INFO] Apache FOP Transcoder All-In-One ................... SKIPPED
[INFO]
------------------------------------------------------------------------
[INFO] BUILD FAILURE
[INFO]
------------------------------------------------------------------------
[INFO] Total time:  02:00 min
[INFO] Finished at: 2020-03-18T15:43:36+01:00
[INFO]
------------------------------------------------------------------------
[ERROR] Failed to execute goal
org.apache.maven.plugins:maven-surefire-plugin:2.18.1:test
(default-test) on project fop-core: There are test failures.
[ERROR]
[ERROR] Please refer to
D:\git\xmlgraphics-fop\fop-core\target\surefire-reports for the
individual test results.
[ERROR] -> [Help 1]
[ERROR]
[ERROR] To see the full stack trace of the errors, re-run Maven with the
-e switch.
[ERROR] Re-run Maven using the -X switch to enable full debug logging.
[ERROR]
[ERROR] For more information about the errors and possible solutions,
please read the following articles:
[ERROR] [Help 1]
http://cwiki.apache.org/confluence/display/MAVEN/MojoFailureException
[ERROR]
[ERROR] After correcting the problems, you can resume the build with the
command
[ERROR]   mvn <args> -rf :fop-core
=================
MAVEN BUILD REPORT
===================

--
Jean-François MAUREL
PIMECA
http://www.pimeca.com

 


---------------------------------------------------------------------
To unsubscribe, e-mail: [hidden email]
For additional commands, e-mail: [hidden email]

Reply | Threaded
Open this post in threaded view
|

RE: build error in fop-trunk

Simon Steiner
Hi,

Try:
mvn clean install -DskipTests

Thanks

-----Original Message-----
From: [hidden email] <[hidden email]>
Sent: 18 March 2020 15:00
To: [hidden email]
Cc: Chris Bowditch <[hidden email]>
Subject: Re: build error in fop-trunk


Hi Chris,

Thank you for your answer.

Le 18/03/2020 à 15:18, Chris Bowditch a écrit :
> Can you share the errors you are seeing?

Sure.

I investigated a little bit more:
1- an event-model.xml was missing because ANT_HOME was not set on my
computer if I am not mistaken.
A comment in the README file could help future users may be.
2- I suspect a problem of 'end of line' (I build on Windows 10 with java
8) in test org.apache.fop.accessibility.fo.FO2StructureTreeConverterTestCase
3- I pasted the full report from maven build below (don't if attachment
are allowed).

> Also don't forget FOP supports older Java versions so might need to
> build with Java 7
  Thanks for the tip.

Regards


===================
MAVEN BUILD REPORT
===================
[INFO] Scanning for projects...
[INFO]
------------------------------------------------------------------------
[INFO] Reactor Build Order:
[INFO]
[INFO] Apache FOP
Parent                                                  [pom]
[INFO] Apache FOP
Utilities                                               [jar]
[INFO] Apache FOP
Events                                                  [jar]
[INFO] Apache FOP
Core                                                    [jar]
[INFO] Apache FOP
All-In-One                                              [jar]
[INFO] Apache FOP
Sandbox                                                 [jar]
[INFO] Apache FOP
Servlet                                                 [war]
[INFO] Apache FOP
Transcoder                                              [jar]
[INFO] Apache FOP Transcoder
All-In-One                                   [jar]
[INFO]
[INFO] -----------------< org.apache.xmlgraphics:fop-parent
 >------------------
[INFO] Building Apache FOP Parent
2.5.0-SNAPSHOT                          [1/9]
[INFO] --------------------------------[ pom
]---------------------------------
[INFO]
[INFO] --- maven-clean-plugin:2.5:clean (default-clean) @ fop-parent ---
[INFO]
[INFO] --- maven-install-plugin:2.4:install (default-install) @
fop-parent ---
[INFO] Installing D:\git\xmlgraphics-fop\pom.xml to
C:\Users\mlamo\.m2\repository\org\apache\xmlgraphics\fop-parent\2.5.0-SNAPSHOT\fop-parent-2.5.0-SNAPSHOT.pom
[INFO]
[INFO] ------------------< org.apache.xmlgraphics:fop-util
 >-------------------
[INFO] Building Apache FOP Utilities
2.5.0-SNAPSHOT                       [2/9]
[INFO] --------------------------------[ jar
]---------------------------------
[INFO]
[INFO] --- maven-clean-plugin:2.5:clean (default-clean) @ fop-util ---
[INFO] Deleting D:\git\xmlgraphics-fop\fop-util\target
[INFO]
[INFO] --- maven-resources-plugin:2.6:resources (default-resources) @
fop-util ---
[INFO] Using 'UTF-8' encoding to copy filtered resources.
[INFO] skip non existing resourceDirectory
D:\git\xmlgraphics-fop\fop-util\src\main\resources
[INFO] Copying 2 resources to META-INF
[INFO]
[INFO] --- maven-compiler-plugin:3.1:compile (default-compile) @
fop-util ---
[INFO] Changes detected - recompiling the module!
[INFO] Compiling 3 source files to
D:\git\xmlgraphics-fop\fop-util\target\classes
[WARNING]
/D:/git/xmlgraphics-fop/fop-util/src/main/java/org/apache/fop/util/XMLResourceBundle.java:
D:\git\xmlgraphics-fop\fop-util\src\main\java\org\apache\fop\util\XMLResourceBundle.java
uses unchecked or unsafe operations.
[WARNING]
/D:/git/xmlgraphics-fop/fop-util/src/main/java/org/apache/fop/util/XMLResourceBundle.java:
Recompile with -Xlint:unchecked for details.
[INFO]
[INFO] --- maven-resources-plugin:2.6:testResources
(default-testResources) @ fop-util ---
[INFO] Using 'UTF-8' encoding to copy filtered resources.
[INFO] skip non existing resourceDirectory
D:\git\xmlgraphics-fop\fop-util\src\test\resources
[INFO]
[INFO] --- maven-compiler-plugin:3.1:testCompile (default-testCompile) @
fop-util ---
[INFO] No sources to compile
[INFO]
[INFO] --- maven-surefire-plugin:2.18.1:test (default-test) @ fop-util ---
[INFO] No tests to run.
[INFO]
[INFO] --- maven-jar-plugin:3.1.1:jar (default-jar) @ fop-util ---
[INFO] Building jar:
D:\git\xmlgraphics-fop\fop-util\target\fop-util-2.5.0-SNAPSHOT.jar
[INFO]
[INFO] --- maven-install-plugin:2.4:install (default-install) @ fop-util ---
[INFO] Installing
D:\git\xmlgraphics-fop\fop-util\target\fop-util-2.5.0-SNAPSHOT.jar to
C:\Users\mlamo\.m2\repository\org\apache\xmlgraphics\fop-util\2.5.0-SNAPSHOT\fop-util-2.5.0-SNAPSHOT.jar
[INFO] Installing D:\git\xmlgraphics-fop\fop-util\pom.xml to
C:\Users\mlamo\.m2\repository\org\apache\xmlgraphics\fop-util\2.5.0-SNAPSHOT\fop-util-2.5.0-SNAPSHOT.pom
[INFO]
[INFO] -----------------< org.apache.xmlgraphics:fop-events
 >------------------
[INFO] Building Apache FOP Events
2.5.0-SNAPSHOT                          [3/9]
[INFO] --------------------------------[ jar
]---------------------------------
[INFO]
[INFO] --- maven-clean-plugin:2.5:clean (default-clean) @ fop-events ---
[INFO] Deleting D:\git\xmlgraphics-fop\fop-events\target
[INFO]
[INFO] --- maven-resources-plugin:2.6:resources (default-resources) @
fop-events ---
[INFO] Using 'UTF-8' encoding to copy filtered resources.
[INFO] Copying 2 resources
[INFO] Copying 2 resources to META-INF
[INFO]
[INFO] --- maven-compiler-plugin:3.1:compile (default-compile) @
fop-events ---
[INFO] Changes detected - recompiling the module!
[INFO] Compiling 16 source files to
D:\git\xmlgraphics-fop\fop-events\target\classes
[WARNING]
/D:/git/xmlgraphics-fop/fop-events/src/main/java/org/apache/fop/events/model/EventModel.java:
Some input files use unchecked or unsafe operations.
[WARNING]
/D:/git/xmlgraphics-fop/fop-events/src/main/java/org/apache/fop/events/model/EventModel.java:
Recompile with -Xlint:unchecked for details.
[INFO]
[INFO] --- maven-resources-plugin:2.6:testResources
(default-testResources) @ fop-events ---
[INFO] Using 'UTF-8' encoding to copy filtered resources.
[INFO] skip non existing resourceDirectory
D:\git\xmlgraphics-fop\fop-events\src\test\resources
[INFO]
[INFO] --- maven-compiler-plugin:3.1:testCompile (default-testCompile) @
fop-events ---
[INFO] Changes detected - recompiling the module!
[INFO] Compiling 2 source files to
D:\git\xmlgraphics-fop\fop-events\target\test-classes
[INFO]
[INFO] --- maven-antrun-plugin:1.8:run (codegen-test-events) @
fop-events ---
[INFO] Executing tasks

main:
[collectEvents] Event model written to
D:\git\xmlgraphics-fop\fop-events\target\test-classes\org\apache\fop\events\event-model.xml
[INFO] Executed tasks
[INFO]
[INFO] --- maven-surefire-plugin:2.18.1:test (default-test) @ fop-events ---
[INFO] Surefire report directory:
D:\git\xmlgraphics-fop\fop-events\target\surefire-reports

-------------------------------------------------------
  T E S T S
-------------------------------------------------------
Running org.apache.fop.events.BasicEventTestCase
Tests run: 2, Failures: 0, Errors: 0, Skipped: 0, Time elapsed: 0.049
sec - in org.apache.fop.events.BasicEventTestCase

Results :

Tests run: 2, Failures: 0, Errors: 0, Skipped: 0

[INFO]
[INFO] --- maven-jar-plugin:3.1.1:jar (default-jar) @ fop-events ---
[INFO] Building jar:
D:\git\xmlgraphics-fop\fop-events\target\fop-events-2.5.0-SNAPSHOT.jar
[INFO]
[INFO] --- maven-install-plugin:2.4:install (default-install) @
fop-events ---
[INFO] Installing
D:\git\xmlgraphics-fop\fop-events\target\fop-events-2.5.0-SNAPSHOT.jar
to
C:\Users\mlamo\.m2\repository\org\apache\xmlgraphics\fop-events\2.5.0-SNAPSHOT\fop-events-2.5.0-SNAPSHOT.jar
[INFO] Installing D:\git\xmlgraphics-fop\fop-events\pom.xml to
C:\Users\mlamo\.m2\repository\org\apache\xmlgraphics\fop-events\2.5.0-SNAPSHOT\fop-events-2.5.0-SNAPSHOT.pom
[INFO]
[INFO] ------------------< org.apache.xmlgraphics:fop-core
 >-------------------
[INFO] Building Apache FOP Core
2.5.0-SNAPSHOT                            [4/9]
[INFO] --------------------------------[ jar
]---------------------------------
[INFO]
[INFO] --- maven-clean-plugin:2.5:clean (default-clean) @ fop-core ---
[INFO]
[INFO] --- xml-maven-plugin:1.0.1:transform (generate-base14-fonts) @
fop-core ---
[INFO] Transforming file:
D:\git\xmlgraphics-fop\fop-core\src\main\codegen\fonts\Courier.xml
[INFO] Transforming file:
D:\git\xmlgraphics-fop\fop-core\src\main\codegen\fonts\CourierBold.xml
[INFO] Transforming file:
D:\git\xmlgraphics-fop\fop-core\src\main\codegen\fonts\CourierBoldOblique.xml
[INFO] Transforming file:
D:\git\xmlgraphics-fop\fop-core\src\main\codegen\fonts\CourierOblique.xml
[INFO] Transforming file:
D:\git\xmlgraphics-fop\fop-core\src\main\codegen\fonts\Helvetica.xml
[INFO] Transforming file:
D:\git\xmlgraphics-fop\fop-core\src\main\codegen\fonts\HelveticaBold.xml
[INFO] Transforming file:
D:\git\xmlgraphics-fop\fop-core\src\main\codegen\fonts\HelveticaBoldOblique.xml
[INFO] Transforming file:
D:\git\xmlgraphics-fop\fop-core\src\main\codegen\fonts\HelveticaOblique.xml
[INFO] Transforming file:
D:\git\xmlgraphics-fop\fop-core\src\main\codegen\fonts\TimesBold.xml
[INFO] Transforming file:
D:\git\xmlgraphics-fop\fop-core\src\main\codegen\fonts\TimesBoldItalic.xml
[INFO] Transforming file:
D:\git\xmlgraphics-fop\fop-core\src\main\codegen\fonts\TimesItalic.xml
[INFO] Transforming file:
D:\git\xmlgraphics-fop\fop-core\src\main\codegen\fonts\TimesRoman.xml
[INFO] Transformed 12 file(s).
[INFO] Transforming file:
D:\git\xmlgraphics-fop\fop-core\src\main\codegen\fonts\Symbol.xml
[INFO] Transforming file:
D:\git\xmlgraphics-fop\fop-core\src\main\codegen\fonts\ZapfDingbats.xml
[INFO] Transformed 2 file(s).
[INFO]
[INFO] --- xml-maven-plugin:1.0.1:transform (codegen-fonts-encodings) @
fop-core ---
[INFO] Transforming file:
D:\git\xmlgraphics-fop\fop-core\src\main\codegen\fonts\encodings.xml
[INFO] Transformed 1 file(s).
[INFO]
[INFO] --- build-helper-maven-plugin:1.9.1:add-source
(add-generated-sources) @ fop-core ---
[INFO] Source directory:
D:\git\xmlgraphics-fop\fop-core\target\generated-sources\main\java added.
[INFO]
[INFO] --- maven-resources-plugin:2.6:resources (default-resources) @
fop-core ---
[INFO] Using 'UTF-8' encoding to copy filtered resources.
[INFO] Copying 59 resources
[INFO] Copying 2 resources to META-INF
[INFO]
[INFO] --- maven-compiler-plugin:3.1:compile (default-compile) @
fop-core ---
[INFO] Changes detected - recompiling the module!
[INFO] Compiling 1559 source files to
D:\git\xmlgraphics-fop\fop-core\target\classes
[WARNING]
/D:/git/xmlgraphics-fop/fop-core/src/main/java/org/apache/fop/fonts/LazyFont.java:
D:\git\xmlgraphics-fop\fop-core\src\main\java\org\apache\fop\fonts\LazyFont.java
uses or overrides a deprecated API.
[WARNING]
/D:/git/xmlgraphics-fop/fop-core/src/main/java/org/apache/fop/fonts/LazyFont.java:
Recompile with -Xlint:deprecation for details.
[WARNING]
/D:/git/xmlgraphics-fop/fop-core/src/main/java/org/apache/fop/util/AbstractPaintingState.java:
Some input files use unchecked or unsafe operations.
[WARNING]
/D:/git/xmlgraphics-fop/fop-core/src/main/java/org/apache/fop/util/AbstractPaintingState.java:
Recompile with -Xlint:unchecked for details.
[INFO]
[INFO] --- maven-antrun-plugin:1.8:run (codegen-events) @ fop-core ---
[INFO] Executing tasks

main:
[collectEvents] Event model written to
D:\git\xmlgraphics-fop\fop-core\target\classes\org\apache\fop\event-model.xml
[collectEvents] Event model written to
D:\git\xmlgraphics-fop\fop-core\target\classes\org\apache\fop\accessibility\event-model.xml
[collectEvents] Event model written to
D:\git\xmlgraphics-fop\fop-core\target\classes\org\apache\fop\afp\event-model.xml
[collectEvents] Event model written to
D:\git\xmlgraphics-fop\fop-core\target\classes\org\apache\fop\area\event-model.xml
[collectEvents] Event model written to
D:\git\xmlgraphics-fop\fop-core\target\classes\org\apache\fop\fo\event-model.xml
[collectEvents] Event model written to
D:\git\xmlgraphics-fop\fop-core\target\classes\org\apache\fop\fo\flow\table\event-model.xml
[collectEvents] Event model written to
D:\git\xmlgraphics-fop\fop-core\target\classes\org\apache\fop\fonts\event-model.xml
[collectEvents] Event model written to
D:\git\xmlgraphics-fop\fop-core\target\classes\org\apache\fop\layoutmgr\event-model.xml
[collectEvents] Event model written to
D:\git\xmlgraphics-fop\fop-core\target\classes\org\apache\fop\layoutmgr\inline\event-model.xml
[collectEvents] Event model written to
D:\git\xmlgraphics-fop\fop-core\target\classes\org\apache\fop\render\event-model.xml
[collectEvents] Event model written to
D:\git\xmlgraphics-fop\fop-core\target\classes\org\apache\fop\render\bitmap\event-model.xml
[collectEvents] Event model written to
D:\git\xmlgraphics-fop\fop-core\target\classes\org\apache\fop\render\pcl\event-model.xml
[collectEvents] Event model written to
D:\git\xmlgraphics-fop\fop-core\target\classes\org\apache\fop\render\pdf\event-model.xml
[collectEvents] Event model written to
D:\git\xmlgraphics-fop\fop-core\target\classes\org\apache\fop\render\pdf\extensions\event-model.xml
[collectEvents] Event model written to
D:\git\xmlgraphics-fop\fop-core\target\classes\org\apache\fop\render\ps\event-model.xml
[collectEvents] Event model written to
D:\git\xmlgraphics-fop\fop-core\target\classes\org\apache\fop\render\rtf\event-model.xml
[collectEvents] Event model written to
D:\git\xmlgraphics-fop\fop-core\target\classes\org\apache\fop\svg\event-model.xml
[INFO] Executed tasks
[INFO]
[INFO] --- maven-resources-plugin:2.6:testResources
(default-testResources) @ fop-core ---
[INFO] Using 'UTF-8' encoding to copy filtered resources.
[INFO] Copying 685 resources
[INFO]
[INFO] --- maven-compiler-plugin:3.1:testCompile (default-testCompile) @
fop-core ---
[INFO] Changes detected - recompiling the module!
[INFO] Compiling 404 source files to
D:\git\xmlgraphics-fop\fop-core\target\test-classes
[WARNING]
/D:/git/xmlgraphics-fop/fop-core/src/test/java/org/apache/fop/fo/flow/table/TableHandler.java:
Some input files use unchecked or unsafe operations.
[WARNING]
/D:/git/xmlgraphics-fop/fop-core/src/test/java/org/apache/fop/fo/flow/table/TableHandler.java:
Recompile with -Xlint:unchecked for details.
[INFO]
[INFO] --- maven-surefire-plugin:2.18.1:test (default-test) @ fop-core ---
[INFO] Surefire report directory:
D:\git\xmlgraphics-fop\fop-core\target\surefire-reports

-------------------------------------------------------
  T E S T S
-------------------------------------------------------
Running org.apache.fop.accessibility.fo.ArtifactImageBugTestCase
Tests run: 1, Failures: 0, Errors: 0, Skipped: 0, Time elapsed: 11.465
sec - in org.apache.fop.accessibility.fo.ArtifactImageBugTestCase
Running org.apache.fop.accessibility.fo.FO2StructureTreeConverterTestCase
Tests run: 9, Failures: 1, Errors: 0, Skipped: 0, Time elapsed: 0.864
sec <<< FAILURE! - in
org.apache.fop.accessibility.fo.FO2StructureTreeConverterTestCase
testRemoveBlocks(org.apache.fop.accessibility.fo.FO2StructureTreeConverterTestCase)
Time elapsed: 0.017 sec  <<< FAILURE!
org.junit.ComparisonFailure: expected:<...cture-tree-sequence>[
<structure-tree xmlns="http://xmlgraphics.apache.org/fop/intermediate"
xmlns:foi="http://xmlgraphics.apache.org/fop/internal"
xmlns:fox="http://xmlgraphics.apache.org/fop/extensions">
<fo:flow xmlns:fo="http://www.w3.org/1999/XSL/Format"
flow-name="xsl-region-body">
<fo:block>
<marked-content/>
</fo:block>
</fo:flow>
</structure-tree>
</structure-tree-sequence>]
 > but was:<...cture-tree-sequence>[
<structure-tree xmlns="http://xmlgraphics.apache.org/fop/intermediate"
xmlns:foi="http://xmlgraphics.apache.org/fop/internal"
xmlns:fox="http://xmlgraphics.apache.org/fop/extensions">
<fo:flow xmlns:fo="http://www.w3.org/1999/XSL/Format"
flow-name="xsl-region-body">
<fo:block>
<marked-content/>
</fo:block>
</fo:flow>
</structure-tree>
</structure-tree-sequence>
]
 >
     at org.junit.Assert.assertEquals(Assert.java:115)
     at org.junit.Assert.assertEquals(Assert.java:144)
     at
org.apache.fop.accessibility.fo.FO2StructureTreeConverterTestCase.compare(FO2StructureTreeConverterTestCase.java:183)
     at
org.apache.fop.accessibility.fo.FO2StructureTreeConverterTestCase.testRemoveBlocks(FO2StructureTreeConverterTestCase.java:142)

Running org.apache.fop.accessibility.fo.PDFUAWarningTestCase
Tests run: 1, Failures: 0, Errors: 0, Skipped: 0, Time elapsed: 0 sec -
in org.apache.fop.accessibility.fo.PDFUAWarningTestCase
Running org.apache.fop.accessibility.pdf.FootnoteSeparatorTestCase
Tests run: 1, Failures: 0, Errors: 0, Skipped: 0, Time elapsed: 0 sec -
in org.apache.fop.accessibility.pdf.FootnoteSeparatorTestCase
Running org.apache.fop.accessibility.pdf.MissingLanguageWarningTestCase
Tests run: 1, Failures: 0, Errors: 0, Skipped: 0, Time elapsed: 0.24 sec
- in org.apache.fop.accessibility.pdf.MissingLanguageWarningTestCase
Running org.apache.fop.afp.AFPEventProcessingTestCase
Tests run: 5, Failures: 0, Errors: 0, Skipped: 0, Time elapsed: 0.842
sec - in org.apache.fop.afp.AFPEventProcessingTestCase
Running org.apache.fop.afp.AFPGraphics2DTestCase
Tests run: 1, Failures: 0, Errors: 0, Skipped: 0, Time elapsed: 0.226
sec - in org.apache.fop.afp.AFPGraphics2DTestCase
Running org.apache.fop.afp.AFPObjectAreaInfoTestCase
Tests run: 2, Failures: 0, Errors: 0, Skipped: 0, Time elapsed: 0 sec -
in org.apache.fop.afp.AFPObjectAreaInfoTestCase
Running org.apache.fop.afp.AFPPaintingStateTestCase
Tests run: 1, Failures: 0, Errors: 0, Skipped: 0, Time elapsed: 0 sec -
in org.apache.fop.afp.AFPPaintingStateTestCase
Running org.apache.fop.afp.AFPResourceManagerTestCase
Tests run: 3, Failures: 0, Errors: 0, Skipped: 0, Time elapsed: 0.118
sec - in org.apache.fop.afp.AFPResourceManagerTestCase
Running org.apache.fop.afp.AFPResourceUtilTestCase
Tests run: 6, Failures: 0, Errors: 0, Skipped: 0, Time elapsed: 0.088
sec - in org.apache.fop.afp.AFPResourceUtilTestCase
Running org.apache.fop.afp.fonts.CharactersetEncoderTestCase
Tests run: 2, Failures: 0, Errors: 0, Skipped: 0, Time elapsed: 0.006
sec - in org.apache.fop.afp.fonts.CharactersetEncoderTestCase
Running org.apache.fop.afp.fonts.IntegerKeyStoreTestCase
Tests run: 1, Failures: 0, Errors: 0, Skipped: 0, Time elapsed: 0 sec -
in org.apache.fop.afp.fonts.IntegerKeyStoreTestCase
Running org.apache.fop.afp.goca.GraphicsCharacterStringTestCase
Tests run: 1, Failures: 0, Errors: 0, Skipped: 0, Time elapsed: 0.001
sec - in org.apache.fop.afp.goca.GraphicsCharacterStringTestCase
Running org.apache.fop.afp.goca.GraphicsSetFractionalLineWidthTestCase
Tests run: 3, Failures: 0, Errors: 0, Skipped: 0, Time elapsed: 0 sec -
in org.apache.fop.afp.goca.GraphicsSetFractionalLineWidthTestCase
Running org.apache.fop.afp.goca.GraphicsSetLineWidthTestCase
Tests run: 3, Failures: 0, Errors: 0, Skipped: 0, Time elapsed: 0 sec -
in org.apache.fop.afp.goca.GraphicsSetLineWidthTestCase
Running org.apache.fop.afp.modca.GraphicsObjectTestCase
Tests run: 1, Failures: 0, Errors: 0, Skipped: 0, Time elapsed: 0.011
sec - in org.apache.fop.afp.modca.GraphicsObjectTestCase
Running org.apache.fop.afp.modca.IncludeObjectTestCase
Tests run: 7, Failures: 0, Errors: 0, Skipped: 0, Time elapsed: 0.021
sec - in org.apache.fop.afp.modca.IncludeObjectTestCase
Running org.apache.fop.afp.parser.MODCAParserTestCase
Tests run: 2, Failures: 0, Errors: 0, Skipped: 0, Time elapsed: 0 sec -
in org.apache.fop.afp.parser.MODCAParserTestCase
Running org.apache.fop.afp.ptoca.TransparentDataControlSequenceTestCase
Tests run: 2, Failures: 0, Errors: 0, Skipped: 0, Time elapsed: 0.152
sec - in org.apache.fop.afp.ptoca.TransparentDataControlSequenceTestCase
Running org.apache.fop.afp.util.AFPResourceAccessorTestCase
Tests run: 2, Failures: 0, Errors: 0, Skipped: 0, Time elapsed: 0.013
sec - in org.apache.fop.afp.util.AFPResourceAccessorTestCase
Running org.apache.fop.apps.EnvironmentalProfileFactoryTestCase
Tests run: 1, Failures: 0, Errors: 0, Skipped: 0, Time elapsed: 0 sec -
in org.apache.fop.apps.EnvironmentalProfileFactoryTestCase
Running org.apache.fop.apps.FopConfParserTestCase
Tests run: 14, Failures: 0, Errors: 0, Skipped: 0, Time elapsed: 0.039
sec - in org.apache.fop.apps.FopConfParserTestCase
Running org.apache.fop.apps.FopFactoryBuilderTestCase
Tests run: 15, Failures: 0, Errors: 0, Skipped: 0, Time elapsed: 0.131
sec - in org.apache.fop.apps.FopFactoryBuilderTestCase
Running org.apache.fop.apps.FopFactoryTestCase
Tests run: 1, Failures: 0, Errors: 0, Skipped: 0, Time elapsed: 0.117
sec - in org.apache.fop.apps.FopFactoryTestCase
Running org.apache.fop.apps.io.ResourceResolverFactoryTestCase
Tests run: 10, Failures: 0, Errors: 0, Skipped: 0, Time elapsed: 0.064
sec - in org.apache.fop.apps.io.ResourceResolverFactoryTestCase
Running org.apache.fop.apps.io.URIResolverWrapperTestCase
Tests run: 4, Failures: 0, Errors: 0, Skipped: 0, Time elapsed: 0.017
sec - in org.apache.fop.apps.io.URIResolverWrapperTestCase
Running org.apache.fop.area.BlockViewportTestCase
Tests run: 2, Failures: 0, Errors: 0, Skipped: 0, Time elapsed: 0 sec -
in org.apache.fop.area.BlockViewportTestCase
Running org.apache.fop.area.inline.InlineViewportTestCase
Tests run: 2, Failures: 0, Errors: 0, Skipped: 0, Time elapsed: 0.001
sec - in org.apache.fop.area.inline.InlineViewportTestCase
Running org.apache.fop.area.RegionViewportTestCase
Tests run: 2, Failures: 0, Errors: 0, Skipped: 0, Time elapsed: 0 sec -
in org.apache.fop.area.RegionViewportTestCase
Running org.apache.fop.area.TraitTestCase
Tests run: 1, Failures: 0, Errors: 0, Skipped: 0, Time elapsed: 0 sec -
in org.apache.fop.area.TraitTestCase
Running org.apache.fop.BasicDriverTestCase
Tests run: 5, Failures: 0, Errors: 0, Skipped: 0, Time elapsed: 0.609
sec - in org.apache.fop.BasicDriverTestCase
Running org.apache.fop.BasicPDFTranscoderTestCase
Tests run: 1, Failures: 0, Errors: 0, Skipped: 0, Time elapsed: 0.814
sec - in org.apache.fop.BasicPDFTranscoderTestCase
Running org.apache.fop.BasicPSTranscoderTestCase
Tests run: 1, Failures: 0, Errors: 0, Skipped: 0, Time elapsed: 0.159
sec - in org.apache.fop.BasicPSTranscoderTestCase
Running org.apache.fop.cli.CommandLineOptionsTestCase
Tests run: 3, Failures: 0, Errors: 0, Skipped: 0, Time elapsed: 0.032
sec - in org.apache.fop.cli.CommandLineOptionsTestCase
Running org.apache.fop.complexscripts.bidi.BidiAlgorithmTestCase
Tests run: 1, Failures: 0, Errors: 0, Skipped: 0, Time elapsed: 4.04 sec
- in org.apache.fop.complexscripts.bidi.BidiAlgorithmTestCase
Running org.apache.fop.complexscripts.bidi.BidiClassTestCase
Tests run: 1, Failures: 0, Errors: 0, Skipped: 0, Time elapsed: 0.109
sec - in org.apache.fop.complexscripts.bidi.BidiClassTestCase
Running org.apache.fop.complexscripts.fonts.GDEFTestCase
Tests run: 4, Failures: 0, Errors: 0, Skipped: 0, Time elapsed: 0.356
sec - in org.apache.fop.complexscripts.fonts.GDEFTestCase
Running org.apache.fop.complexscripts.fonts.GPOSTestCase
Tests run: 8, Failures: 0, Errors: 0, Skipped: 0, Time elapsed: 0.032
sec - in org.apache.fop.complexscripts.fonts.GPOSTestCase
Running org.apache.fop.complexscripts.fonts.GSUBTestCase
Tests run: 6, Failures: 0, Errors: 0, Skipped: 0, Time elapsed: 0.033
sec - in org.apache.fop.complexscripts.fonts.GSUBTestCase
Running org.apache.fop.complexscripts.fonts.ttx.TTXFileTestCase
Tests run: 1, Failures: 0, Errors: 0, Skipped: 0, Time elapsed: 0 sec -
in org.apache.fop.complexscripts.fonts.ttx.TTXFileTestCase
Running org.apache.fop.complexscripts.layout.ComplexScriptsLayoutTestCase
Tests run: 1, Failures: 0, Errors: 0, Skipped: 0, Time elapsed: 0.115
sec - in org.apache.fop.complexscripts.layout.ComplexScriptsLayoutTestCase
Running org.apache.fop.complexscripts.scripts.arabic.ArabicJoinersTestCase
Tests run: 2, Failures: 0, Errors: 0, Skipped: 0, Time elapsed: 0.024
sec - in org.apache.fop.complexscripts.scripts.arabic.ArabicJoinersTestCase
Running org.apache.fop.complexscripts.scripts.arabic.ArabicWordFormsTestCase
Tests run: 1, Failures: 0, Errors: 0, Skipped: 0, Time elapsed: 19.008
sec - in
org.apache.fop.complexscripts.scripts.arabic.ArabicWordFormsTestCase
Running org.apache.fop.complexscripts.scripts.KhmerTestCase
Tests run: 4, Failures: 0, Errors: 0, Skipped: 0, Time elapsed: 0.057
sec - in org.apache.fop.complexscripts.scripts.KhmerTestCase
Running org.apache.fop.complexscripts.util.NumberConverterTestCase
Tests run: 13, Failures: 0, Errors: 0, Skipped: 0, Time elapsed: 0.047
sec - in org.apache.fop.complexscripts.util.NumberConverterTestCase
Running org.apache.fop.config.FontAttributesMissingTestCase
Tests run: 1, Failures: 0, Errors: 0, Skipped: 0, Time elapsed: 0.002
sec - in org.apache.fop.config.FontAttributesMissingTestCase
Running org.apache.fop.config.FontMetricsUrlBadTestCase
Tests run: 1, Failures: 0, Errors: 0, Skipped: 0, Time elapsed: 0.001
sec - in org.apache.fop.config.FontMetricsUrlBadTestCase
Running org.apache.fop.config.FontMetricsUrlMalformedTestCase
Tests run: 1, Failures: 0, Errors: 0, Skipped: 0, Time elapsed: 0.001
sec - in org.apache.fop.config.FontMetricsUrlMalformedTestCase
Running org.apache.fop.config.FontsAutoDetectTestCase
Tests run: 1, Failures: 0, Errors: 0, Skipped: 0, Time elapsed: 0.277
sec - in org.apache.fop.config.FontsAutoDetectTestCase
Running org.apache.fop.config.FontsDirectoryRecursiveTestCase
Tests run: 1, Failures: 0, Errors: 0, Skipped: 0, Time elapsed: 0.023
sec - in org.apache.fop.config.FontsDirectoryRecursiveTestCase
Running org.apache.fop.config.FontsSubstitutionTestCase
Tests run: 1, Failures: 0, Errors: 0, Skipped: 0, Time elapsed: 0.027
sec - in org.apache.fop.config.FontsSubstitutionTestCase
Running org.apache.fop.config.FontTripletAttributeMissingTestCase
Tests run: 1, Failures: 0, Errors: 0, Skipped: 0, Time elapsed: 0 sec -
in org.apache.fop.config.FontTripletAttributeMissingTestCase
Running org.apache.fop.datatypes.URISpecificationTestCase
Tests run: 2, Failures: 0, Errors: 0, Skipped: 0, Time elapsed: 0 sec -
in org.apache.fop.datatypes.URISpecificationTestCase
Running org.apache.fop.DigestFilterTestCase
Tests run: 3, Failures: 0, Errors: 0, Skipped: 0, Time elapsed: 0.008
sec - in org.apache.fop.DigestFilterTestCase
Running org.apache.fop.events.EventProcessingTestCase
Tests run: 10, Failures: 0, Errors: 0, Skipped: 0, Time elapsed: 0.283
sec - in org.apache.fop.events.EventProcessingTestCase
Running org.apache.fop.events.FlowNamedNotMappedTestCase
Tests run: 1, Failures: 0, Errors: 0, Skipped: 0, Time elapsed: 0.008
sec - in org.apache.fop.events.FlowNamedNotMappedTestCase
Running org.apache.fop.fo.DelegatingFOEventHandlerTestCase
Tests run: 1, Failures: 0, Errors: 0, Skipped: 0, Time elapsed: 0.04 sec
- in org.apache.fop.fo.DelegatingFOEventHandlerTestCase
Running org.apache.fop.fo.flow.MarkersTestCase
Tests run: 1, Failures: 0, Errors: 0, Skipped: 0, Time elapsed: 0.024
sec - in org.apache.fop.fo.flow.MarkersTestCase
Running org.apache.fop.fo.flow.table.CollapsedConditionalBorderTestCase
Tests run: 2, Failures: 0, Errors: 0, Skipped: 0, Time elapsed: 0.039
sec - in org.apache.fop.fo.flow.table.CollapsedConditionalBorderTestCase
Running org.apache.fop.fo.flow.table.HeaderColumnTestCase
Tests run: 2, Failures: 0, Errors: 0, Skipped: 0, Time elapsed: 0.04 sec
- in org.apache.fop.fo.flow.table.HeaderColumnTestCase
Running org.apache.fop.fo.flow.table.IllegalRowSpanTestCase
Tests run: 4, Failures: 0, Errors: 0, Skipped: 0, Time elapsed: 0.015
sec - in org.apache.fop.fo.flow.table.IllegalRowSpanTestCase
Running org.apache.fop.fo.flow.table.RowGroupBuilderTestCase
Tests run: 8, Failures: 0, Errors: 0, Skipped: 0, Time elapsed: 0.08 sec
- in org.apache.fop.fo.flow.table.RowGroupBuilderTestCase
Running org.apache.fop.fo.flow.table.TableColumnColumnNumberTestCase
Tests run: 2, Failures: 0, Errors: 0, Skipped: 0, Time elapsed: 0.013
sec - in org.apache.fop.fo.flow.table.TableColumnColumnNumberTestCase
Running org.apache.fop.fo.flow.table.TooManyColumnsTestCase
Tests run: 6, Failures: 0, Errors: 0, Skipped: 0, Time elapsed: 0.015
sec - in org.apache.fop.fo.flow.table.TooManyColumnsTestCase
Running org.apache.fop.fo.pagination.LayoutMasterSetTestCase
Tests run: 1, Failures: 0, Errors: 0, Skipped: 0, Time elapsed: 0.013
sec - in org.apache.fop.fo.pagination.LayoutMasterSetTestCase
Running org.apache.fop.fo.pagination.PageSequenceMasterTestCase
Tests run: 2, Failures: 0, Errors: 0, Skipped: 0, Time elapsed: 0.042
sec - in org.apache.fop.fo.pagination.PageSequenceMasterTestCase
Running
org.apache.fop.fo.pagination.RepeatablePageMasterAlternativesTestCase
Tests run: 4, Failures: 0, Errors: 0, Skipped: 0, Time elapsed: 0.029
sec - in
org.apache.fop.fo.pagination.RepeatablePageMasterAlternativesTestCase
Running org.apache.fop.fo.properties.AltTextHolderTestCase
Tests run: 2, Failures: 0, Errors: 0, Skipped: 0, Time elapsed: 0.023
sec - in org.apache.fop.fo.properties.AltTextHolderTestCase
Running org.apache.fop.fo.properties.CommonAccessibilityHolderTestCase
Tests run: 1, Failures: 0, Errors: 0, Skipped: 0, Time elapsed: 0.039
sec - in org.apache.fop.fo.properties.CommonAccessibilityHolderTestCase
Running org.apache.fop.fo.properties.CommonHyphenationTestCase
Tests run: 3, Failures: 0, Errors: 0, Skipped: 0, Time elapsed: 0 sec -
in org.apache.fop.fo.properties.CommonHyphenationTestCase
Running org.apache.fop.fonts.cff.CFFDataReaderTestCase
Tests run: 2, Failures: 0, Errors: 0, Skipped: 0, Time elapsed: 0.025
sec - in org.apache.fop.fonts.cff.CFFDataReaderTestCase
Running org.apache.fop.fonts.CIDFullTestCase
Tests run: 9, Failures: 0, Errors: 0, Skipped: 0, Time elapsed: 0.017
sec - in org.apache.fop.fonts.CIDFullTestCase
Running org.apache.fop.fonts.CIDSubsetTestCase
Tests run: 9, Failures: 0, Errors: 0, Skipped: 0, Time elapsed: 0.002
sec - in org.apache.fop.fonts.CIDSubsetTestCase
Running org.apache.fop.fonts.DejaVuLGCSerifTestCase
Tests run: 3, Failures: 0, Errors: 0, Skipped: 0, Time elapsed: 0.019
sec - in org.apache.fop.fonts.DejaVuLGCSerifTestCase
Running org.apache.fop.fonts.EmbedFontInfoTestCase
Tests run: 3, Failures: 0, Errors: 0, Skipped: 0, Time elapsed: 0 sec -
in org.apache.fop.fonts.EmbedFontInfoTestCase
Running org.apache.fop.fonts.EncodingModeTestCase
Tests run: 3, Failures: 0, Errors: 0, Skipped: 0, Time elapsed: 0 sec -
in org.apache.fop.fonts.EncodingModeTestCase
Running org.apache.fop.fonts.FontEventProcessingTestCase
Tests run: 2, Failures: 0, Errors: 0, Skipped: 0, Time elapsed: 0.023
sec - in org.apache.fop.fonts.FontEventProcessingTestCase
Running org.apache.fop.fonts.FontManagerConfiguratorTestCase
Tests run: 6, Failures: 0, Errors: 0, Skipped: 0, Time elapsed: 0.01 sec
- in org.apache.fop.fonts.FontManagerConfiguratorTestCase
Running org.apache.fop.fonts.FontManagerTestCase
Tests run: 5, Failures: 0, Errors: 0, Skipped: 0, Time elapsed: 0.009
sec - in org.apache.fop.fonts.FontManagerTestCase
Running org.apache.fop.fonts.FontSelectorTestCase
Tests run: 1, Failures: 0, Errors: 0, Skipped: 0, Time elapsed: 0.033
sec - in org.apache.fop.fonts.FontSelectorTestCase
Running org.apache.fop.fonts.LazyFontTestCase
Tests run: 1, Failures: 0, Errors: 0, Skipped: 0, Time elapsed: 0 sec -
in org.apache.fop.fonts.LazyFontTestCase
Running org.apache.fop.fonts.truetype.FontFileReaderTestCase
Tests run: 15, Failures: 0, Errors: 0, Skipped: 0, Time elapsed: 0 sec -
in org.apache.fop.fonts.truetype.FontFileReaderTestCase
Running org.apache.fop.fonts.truetype.GlyfTableTestCase
Tests run: 4, Failures: 0, Errors: 0, Skipped: 0, Time elapsed: 0.011
sec - in org.apache.fop.fonts.truetype.GlyfTableTestCase
Running org.apache.fop.fonts.truetype.OTFFileTestCase
Tests run: 3, Failures: 0, Errors: 0, Skipped: 0, Time elapsed: 0.019
sec - in org.apache.fop.fonts.truetype.OTFFileTestCase
Running org.apache.fop.fonts.truetype.OTFSubSetFileTestCase
Tests run: 14, Failures: 0, Errors: 0, Skipped: 0, Time elapsed: 0.18
sec - in org.apache.fop.fonts.truetype.OTFSubSetFileTestCase
Running org.apache.fop.fonts.truetype.OTFToType1TestCase
Tests run: 2, Failures: 0, Errors: 0, Skipped: 0, Time elapsed: 0.036
sec - in org.apache.fop.fonts.truetype.OTFToType1TestCase
Running org.apache.fop.fonts.truetype.TTFFileTestCase
Tests run: 30, Failures: 0, Errors: 0, Skipped: 0, Time elapsed: 0.193
sec - in org.apache.fop.fonts.truetype.TTFFileTestCase
Running org.apache.fop.fonts.truetype.TTFFontLoaderTestCase
Tests run: 1, Failures: 0, Errors: 0, Skipped: 0, Time elapsed: 0.011
sec - in org.apache.fop.fonts.truetype.TTFFontLoaderTestCase
Running org.apache.fop.fonts.truetype.TTFSubSetFileTestCase
Tests run: 31, Failures: 0, Errors: 0, Skipped: 0, Time elapsed: 0.141
sec - in org.apache.fop.fonts.truetype.TTFSubSetFileTestCase
Running org.apache.fop.fonts.truetype.TTFTableNameTestCase
Tests run: 4, Failures: 0, Errors: 0, Skipped: 0, Time elapsed: 0 sec -
in org.apache.fop.fonts.truetype.TTFTableNameTestCase
Running org.apache.fop.fonts.type1.AdobeStandardEncodingTestCase
Tests run: 1, Failures: 0, Errors: 0, Skipped: 0, Time elapsed: 0.009
sec - in org.apache.fop.fonts.type1.AdobeStandardEncodingTestCase
Running org.apache.fop.fonts.type1.AFMParserTestCase
Tests run: 2, Failures: 0, Errors: 0, Skipped: 0, Time elapsed: 0.17 sec
- in org.apache.fop.fonts.type1.AFMParserTestCase
Running org.apache.fop.fonts.type1.CharMetricsHandlerTestCase
Tests run: 1, Failures: 0, Errors: 0, Skipped: 0, Time elapsed: 0.009
sec - in org.apache.fop.fonts.type1.CharMetricsHandlerTestCase
Running org.apache.fop.fonts.type1.PostscriptParserTestCase
Tests run: 2, Failures: 0, Errors: 0, Skipped: 0, Time elapsed: 0.006
sec - in org.apache.fop.fonts.type1.PostscriptParserTestCase
Running org.apache.fop.fonts.type1.Type1FontLoaderTestCase
Tests run: 1, Failures: 0, Errors: 0, Skipped: 0, Time elapsed: 0.018
sec - in org.apache.fop.fonts.type1.Type1FontLoaderTestCase
Running org.apache.fop.fonts.type1.Type1SubsetFileTestCase
Tests run: 7, Failures: 0, Errors: 0, Skipped: 0, Time elapsed: 0.209
sec - in org.apache.fop.fonts.type1.Type1SubsetFileTestCase
Running org.apache.fop.fotreetest.FOTreeTestCase
Tests run: 41, Failures: 0, Errors: 0, Skipped: 0, Time elapsed: 0.391
sec - in org.apache.fop.fotreetest.FOTreeTestCase
Running org.apache.fop.HyphenationTestCase
Tests run: 3, Failures: 0, Errors: 0, Skipped: 0, Time elapsed: 0.05 sec
- in org.apache.fop.HyphenationTestCase
Running org.apache.fop.image.loader.batik.Graphics2DImagePainterImplTestCase
Tests run: 1, Failures: 0, Errors: 0, Skipped: 0, Time elapsed: 0.015
sec - in
org.apache.fop.image.loader.batik.Graphics2DImagePainterImplTestCase
Running org.apache.fop.image.loader.batik.ImageLoaderTestCase
Tests run: 1, Failures: 0, Errors: 0, Skipped: 1, Time elapsed: 0 sec -
in org.apache.fop.image.loader.batik.ImageLoaderTestCase
Running org.apache.fop.image.loader.batik.ImagePreloaderTestCase
Tests run: 5, Failures: 0, Errors: 0, Skipped: 1, Time elapsed: 0.224
sec - in org.apache.fop.image.loader.batik.ImagePreloaderTestCase
Running org.apache.fop.intermediate.AreaTreeParserTestCase
Tests run: 671, Failures: 0, Errors: 0, Skipped: 0, Time elapsed: 25.392
sec - in org.apache.fop.intermediate.AreaTreeParserTestCase
Running org.apache.fop.intermediate.IFMimickingTestCase
Tests run: 3, Failures: 0, Errors: 0, Skipped: 0, Time elapsed: 0.052
sec - in org.apache.fop.intermediate.IFMimickingTestCase
Running org.apache.fop.intermediate.IFParserTestCase
Tests run: 671, Failures: 0, Errors: 0, Skipped: 0, Time elapsed: 6.46
sec - in org.apache.fop.intermediate.IFParserTestCase
Running org.apache.fop.intermediate.IFTestCase
Tests run: 11, Failures: 0, Errors: 0, Skipped: 0, Time elapsed: 0.205
sec - in org.apache.fop.intermediate.IFTestCase
Running org.apache.fop.KnuthAlgorithmTestCase
Tests run: 1, Failures: 0, Errors: 0, Skipped: 0, Time elapsed: 0.01 sec
- in org.apache.fop.KnuthAlgorithmTestCase
Running org.apache.fop.layoutengine.HyphenationLayoutTestCase
Tests run: 13, Failures: 0, Errors: 0, Skipped: 0, Time elapsed: 0.567
sec - in org.apache.fop.layoutengine.HyphenationLayoutTestCase
Running org.apache.fop.layoutengine.LayoutEngineTestCase
Tests run: 671, Failures: 0, Errors: 0, Skipped: 0, Time elapsed: 13.335
sec - in org.apache.fop.layoutengine.LayoutEngineTestCase
Running org.apache.fop.layoutmgr.BreakElementTestCase
Tests run: 1, Failures: 0, Errors: 0, Skipped: 0, Time elapsed: 0.001
sec - in org.apache.fop.layoutmgr.BreakElementTestCase
Running org.apache.fop.layoutmgr.PageSequenceLayoutManagerTestCase
Tests run: 3, Failures: 0, Errors: 0, Skipped: 0, Time elapsed: 0.037
sec - in org.apache.fop.layoutmgr.PageSequenceLayoutManagerTestCase
Running
org.apache.fop.layoutmgr.RetrieveTableMarkerLayoutManagerMakerTestCase
Tests run: 1, Failures: 0, Errors: 0, Skipped: 0, Time elapsed: 0.002
sec - in
org.apache.fop.layoutmgr.RetrieveTableMarkerLayoutManagerMakerTestCase
Running org.apache.fop.layoutmgr.RetrieveTableMarkerLayoutManagerTestCase
Tests run: 1, Failures: 0, Errors: 0, Skipped: 0, Time elapsed: 0.033
sec - in org.apache.fop.layoutmgr.RetrieveTableMarkerLayoutManagerTestCase
Running org.apache.fop.layoutmgr.table.TableCellLayoutManagerTestCase
Tests run: 1, Failures: 0, Errors: 0, Skipped: 0, Time elapsed: 0.047
sec - in org.apache.fop.layoutmgr.table.TableCellLayoutManagerTestCase
Running org.apache.fop.layoutmgr.table.TableContentLayoutManagerTestCase
Tests run: 1, Failures: 0, Errors: 0, Skipped: 0, Time elapsed: 0.005
sec - in org.apache.fop.layoutmgr.table.TableContentLayoutManagerTestCase
Running org.apache.fop.layoutmgr.table.TableLayoutManagerTestCase
Tests run: 2, Failures: 0, Errors: 0, Skipped: 0, Time elapsed: 0.013
sec - in org.apache.fop.layoutmgr.table.TableLayoutManagerTestCase
Running org.apache.fop.pdf.AbstractPDFStreamTestCase
Tests run: 10, Failures: 0, Errors: 0, Skipped: 0, Time elapsed: 0 sec -
in org.apache.fop.pdf.AbstractPDFStreamTestCase
Running org.apache.fop.pdf.FileIDGeneratorTestCase
Tests run: 8, Failures: 0, Errors: 0, Skipped: 0, Time elapsed: 0 sec -
in org.apache.fop.pdf.FileIDGeneratorTestCase
Running org.apache.fop.pdf.ObjectStreamManagerTestCase
Tests run: 1, Failures: 0, Errors: 0, Skipped: 0, Time elapsed: 0.005
sec - in org.apache.fop.pdf.ObjectStreamManagerTestCase
Running org.apache.fop.pdf.ObjectStreamTestCase
Tests run: 4, Failures: 0, Errors: 0, Skipped: 0, Time elapsed: 0 sec -
in org.apache.fop.pdf.ObjectStreamTestCase
Running org.apache.fop.pdf.PDFAModeTestCase
Tests run: 6, Failures: 0, Errors: 0, Skipped: 0, Time elapsed: 0.004
sec - in org.apache.fop.pdf.PDFAModeTestCase
Running org.apache.fop.pdf.PDFArrayTestCase
Tests run: 15, Failures: 0, Errors: 0, Skipped: 0, Time elapsed: 0.001
sec - in org.apache.fop.pdf.PDFArrayTestCase
Running org.apache.fop.pdf.PDFAttachmentTestCase
Tests run: 3, Failures: 0, Errors: 0, Skipped: 0, Time elapsed: 0.018
sec - in org.apache.fop.pdf.PDFAttachmentTestCase
Running org.apache.fop.pdf.PDFDestsTestCase
Tests run: 10, Failures: 0, Errors: 0, Skipped: 0, Time elapsed: 0 sec -
in org.apache.fop.pdf.PDFDestsTestCase
Running org.apache.fop.pdf.PDFDictionaryTestCase
Tests run: 13, Failures: 0, Errors: 0, Skipped: 0, Time elapsed: 0 sec -
in org.apache.fop.pdf.PDFDictionaryTestCase
Running org.apache.fop.pdf.PDFDocumentGraphics2DTestCase
Tests run: 1, Failures: 0, Errors: 0, Skipped: 0, Time elapsed: 0.001
sec - in org.apache.fop.pdf.PDFDocumentGraphics2DTestCase
Running org.apache.fop.pdf.PDFDocumentTestCase
Tests run: 1, Failures: 0, Errors: 0, Skipped: 0, Time elapsed: 0 sec -
in org.apache.fop.pdf.PDFDocumentTestCase
Running org.apache.fop.pdf.PDFEncodingTestCase
Tests run: 4, Failures: 0, Errors: 0, Skipped: 0, Time elapsed: 0.004
sec - in org.apache.fop.pdf.PDFEncodingTestCase
Running org.apache.fop.pdf.PDFEncryptionJCETestCase
Tests run: 11, Failures: 0, Errors: 0, Skipped: 0, Time elapsed: 0.104
sec - in org.apache.fop.pdf.PDFEncryptionJCETestCase
Running org.apache.fop.pdf.PDFFactoryTestCase
Tests run: 5, Failures: 0, Errors: 0, Skipped: 0, Time elapsed: 0.022
sec - in org.apache.fop.pdf.PDFFactoryTestCase
Running org.apache.fop.pdf.PDFFileSpecTestCase
Tests run: 1, Failures: 0, Errors: 0, Skipped: 0, Time elapsed: 0 sec -
in org.apache.fop.pdf.PDFFileSpecTestCase
Running org.apache.fop.pdf.PDFFilterListTestCase
Tests run: 1, Failures: 0, Errors: 0, Skipped: 0, Time elapsed: 0 sec -
in org.apache.fop.pdf.PDFFilterListTestCase
Running org.apache.fop.pdf.PDFImageXObjectTestCase
Tests run: 2, Failures: 0, Errors: 0, Skipped: 0, Time elapsed: 0.033
sec - in org.apache.fop.pdf.PDFImageXObjectTestCase
Running org.apache.fop.pdf.PDFJavaScriptLaunchActionTestCase
Tests run: 1, Failures: 0, Errors: 0, Skipped: 0, Time elapsed: 0 sec -
in org.apache.fop.pdf.PDFJavaScriptLaunchActionTestCase
Running org.apache.fop.pdf.PDFLinearizationTestCase
Tests run: 2, Failures: 0, Errors: 0, Skipped: 0, Time elapsed: 0.036
sec - in org.apache.fop.pdf.PDFLinearizationTestCase
Running org.apache.fop.pdf.PDFLinkTestCase
Tests run: 181, Failures: 0, Errors: 0, Skipped: 0, Time elapsed: 0.207
sec - in org.apache.fop.pdf.PDFLinkTestCase
Running org.apache.fop.pdf.PDFNameTestCase
Tests run: 13, Failures: 0, Errors: 0, Skipped: 0, Time elapsed: 0 sec -
in org.apache.fop.pdf.PDFNameTestCase
Running org.apache.fop.pdf.PDFNullTestCase
Tests run: 10, Failures: 0, Errors: 0, Skipped: 0, Time elapsed: 0.001
sec - in org.apache.fop.pdf.PDFNullTestCase
Running org.apache.fop.pdf.PDFNumberTestCase
Tests run: 10, Failures: 0, Errors: 0, Skipped: 0, Time elapsed: 0 sec -
in org.apache.fop.pdf.PDFNumberTestCase
Running org.apache.fop.pdf.PDFNumsArrayTestCase
Tests run: 10, Failures: 0, Errors: 0, Skipped: 0, Time elapsed: 0 sec -
in org.apache.fop.pdf.PDFNumsArrayTestCase
Running org.apache.fop.pdf.PDFObjectTestCase
Tests run: 9, Failures: 0, Errors: 0, Skipped: 0, Time elapsed: 0 sec -
in org.apache.fop.pdf.PDFObjectTestCase
Running org.apache.fop.pdf.PDFPageLabelsTestCase
Tests run: 1, Failures: 0, Errors: 0, Skipped: 0, Time elapsed: 0 sec -
in org.apache.fop.pdf.PDFPageLabelsTestCase
Running org.apache.fop.pdf.PDFPagePieceTestCase
Tests run: 1, Failures: 0, Errors: 0, Skipped: 0, Time elapsed: 0.003
sec - in org.apache.fop.pdf.PDFPagePieceTestCase
Running org.apache.fop.pdf.PDFParentTreeTestCase
Tests run: 4, Failures: 0, Errors: 0, Skipped: 0, Time elapsed: 0.008
sec - in org.apache.fop.pdf.PDFParentTreeTestCase
Running org.apache.fop.pdf.PDFRectangleTestCase
Tests run: 1, Failures: 0, Errors: 0, Skipped: 0, Time elapsed: 0 sec -
in org.apache.fop.pdf.PDFRectangleTestCase
Running org.apache.fop.pdf.PDFReferenceTestCase
Tests run: 2, Failures: 0, Errors: 0, Skipped: 0, Time elapsed: 0 sec -
in org.apache.fop.pdf.PDFReferenceTestCase
Running org.apache.fop.pdf.PDFResourcesTestCase
Tests run: 3, Failures: 0, Errors: 0, Skipped: 0, Time elapsed: 0.017
sec - in org.apache.fop.pdf.PDFResourcesTestCase
Running org.apache.fop.pdf.PDFRootTestCase
Tests run: 1, Failures: 0, Errors: 0, Skipped: 0, Time elapsed: 0 sec -
in org.apache.fop.pdf.PDFRootTestCase
Running org.apache.fop.pdf.PDFStreamTestCase
Tests run: 6, Failures: 0, Errors: 0, Skipped: 0, Time elapsed: 0.001
sec - in org.apache.fop.pdf.PDFStreamTestCase
Running org.apache.fop.pdf.PDFUATestCase
Tests run: 2, Failures: 0, Errors: 0, Skipped: 0, Time elapsed: 0 sec -
in org.apache.fop.pdf.PDFUATestCase
Running org.apache.fop.pdf.PDFVTTestCase
Tests run: 4, Failures: 0, Errors: 0, Skipped: 0, Time elapsed: 0.261
sec - in org.apache.fop.pdf.PDFVTTestCase
Running org.apache.fop.pdf.TableHeaderScopeTestCase
Tests run: 3, Failures: 0, Errors: 0, Skipped: 0, Time elapsed: 0.016
sec - in org.apache.fop.pdf.TableHeaderScopeTestCase
Running org.apache.fop.pdf.VersionControllerTestCase
Tests run: 2, Failures: 0, Errors: 0, Skipped: 0, Time elapsed: 0 sec -
in org.apache.fop.pdf.VersionControllerTestCase
Running org.apache.fop.pdf.VersionTestCase
Tests run: 4, Failures: 0, Errors: 0, Skipped: 0, Time elapsed: 0 sec -
in org.apache.fop.pdf.VersionTestCase
Running org.apache.fop.pdf.xref.CompressedObjectReferenceTestCase
Tests run: 1, Failures: 0, Errors: 0, Skipped: 0, Time elapsed: 0 sec -
in org.apache.fop.pdf.xref.CompressedObjectReferenceTestCase
Running org.apache.fop.pdf.xref.CrossReferenceStreamTestCase
Tests run: 5, Failures: 0, Errors: 0, Skipped: 0, Time elapsed: 0.005
sec - in org.apache.fop.pdf.xref.CrossReferenceStreamTestCase
Running org.apache.fop.pdf.xref.CrossReferenceTableTestCase
Tests run: 3, Failures: 0, Errors: 0, Skipped: 0, Time elapsed: 0 sec -
in org.apache.fop.pdf.xref.CrossReferenceTableTestCase
Running org.apache.fop.pdf.xref.UncompressedObjectReferenceTestCase
Tests run: 6, Failures: 0, Errors: 0, Skipped: 0, Time elapsed: 0.001
sec - in org.apache.fop.pdf.xref.UncompressedObjectReferenceTestCase
Running org.apache.fop.render.AbstractPathOrientedRendererTestCase
Tests run: 1, Failures: 0, Errors: 0, Skipped: 0, Time elapsed: 0.005
sec - in org.apache.fop.render.AbstractPathOrientedRendererTestCase
Running org.apache.fop.render.afp.AFPBorderPainterTestCase
Tests run: 2, Failures: 0, Errors: 0, Skipped: 0, Time elapsed: 0 sec -
in org.apache.fop.render.afp.AFPBorderPainterTestCase
Running org.apache.fop.render.afp.AFPImageHandlerGraphics2DTestCase
Tests run: 1, Failures: 0, Errors: 0, Skipped: 0, Time elapsed: 0.006
sec - in org.apache.fop.render.afp.AFPImageHandlerGraphics2DTestCase
Running org.apache.fop.render.afp.AFPImageHandlerTestCase
Tests run: 1, Failures: 0, Errors: 0, Skipped: 0, Time elapsed: 0 sec -
in org.apache.fop.render.afp.AFPImageHandlerTestCase
Running org.apache.fop.render.afp.AFPPainterTestCase
Tests run: 4, Failures: 0, Errors: 0, Skipped: 0, Time elapsed: 6.205
sec - in org.apache.fop.render.afp.AFPPainterTestCase
Running org.apache.fop.render.afp.AFPRendererConfigParserTestCase
Tests run: 15, Failures: 0, Errors: 0, Skipped: 0, Time elapsed: 0.044
sec - in org.apache.fop.render.afp.AFPRendererConfigParserTestCase
Running org.apache.fop.render.afp.AFPRendererConfiguratorTestCase
Tests run: 18, Failures: 0, Errors: 0, Skipped: 0, Time elapsed: 0.062
sec - in org.apache.fop.render.afp.AFPRendererConfiguratorTestCase
Running org.apache.fop.render.afp.AFPTrueTypeTestCase
Tests run: 3, Failures: 0, Errors: 0, Skipped: 0, Time elapsed: 0.126
sec - in org.apache.fop.render.afp.AFPTrueTypeTestCase
Running org.apache.fop.render.afp.NoOperationTestCase
Tests run: 1, Failures: 0, Errors: 0, Skipped: 0, Time elapsed: 0.028
sec - in org.apache.fop.render.afp.NoOperationTestCase
Running org.apache.fop.render.bitmap.BitmapRendererConfigParserTestCase
Tests run: 5, Failures: 0, Errors: 0, Skipped: 0, Time elapsed: 0.02 sec
- in org.apache.fop.render.bitmap.BitmapRendererConfigParserTestCase
Running org.apache.fop.render.bitmap.BitmapRendererConfiguratorTestCase
Tests run: 5, Failures: 0, Errors: 0, Skipped: 0, Time elapsed: 0.018
sec - in org.apache.fop.render.bitmap.BitmapRendererConfiguratorTestCase
Running org.apache.fop.render.bitmap.TIFFCompressionValueTestCase
Tests run: 3, Failures: 0, Errors: 0, Skipped: 0, Time elapsed: 0 sec -
in org.apache.fop.render.bitmap.TIFFCompressionValueTestCase
Running org.apache.fop.render.bitmap.TIFFRendererConfigParserTestCase
Tests run: 8, Failures: 0, Errors: 0, Skipped: 0, Time elapsed: 0.024
sec - in org.apache.fop.render.bitmap.TIFFRendererConfigParserTestCase
Running org.apache.fop.render.bitmap.TIFFRendererConfiguratorTestCase
Tests run: 7, Failures: 0, Errors: 0, Skipped: 0, Time elapsed: 0.025
sec - in org.apache.fop.render.bitmap.TIFFRendererConfiguratorTestCase
Running org.apache.fop.render.ConserveMemoryTestCase
Tests run: 1, Failures: 0, Errors: 0, Skipped: 0, Time elapsed: 0.062
sec - in org.apache.fop.render.ConserveMemoryTestCase
Running org.apache.fop.render.extensions.DocumentNavigationHandlerTestCase
Tests run: 4, Failures: 0, Errors: 0, Skipped: 0, Time elapsed: 0.025
sec - in org.apache.fop.render.extensions.DocumentNavigationHandlerTestCase
Running org.apache.fop.render.extensions.prepress.PageBoundariesTestCase
Tests run: 8, Failures: 0, Errors: 0, Skipped: 0, Time elapsed: 0 sec -
in org.apache.fop.render.extensions.prepress.PageBoundariesTestCase
Running org.apache.fop.render.extensions.prepress.PageScaleTestCase
Tests run: 4, Failures: 0, Errors: 0, Skipped: 0, Time elapsed: 0 sec -
in org.apache.fop.render.extensions.prepress.PageScaleTestCase
Running org.apache.fop.render.gradient.GradientTestCase
Tests run: 6, Failures: 0, Errors: 0, Skipped: 0, Time elapsed: 0.023
sec - in org.apache.fop.render.gradient.GradientTestCase
Running org.apache.fop.render.intermediate.AbstractIFPainterTestCase
Tests run: 2, Failures: 0, Errors: 0, Skipped: 0, Time elapsed: 0.008
sec - in org.apache.fop.render.intermediate.AbstractIFPainterTestCase
Running
org.apache.fop.render.intermediate.ArcToBezierCurveTransformerTestCase
Tests run: 1, Failures: 0, Errors: 0, Skipped: 0, Time elapsed: 0.001
sec - in
org.apache.fop.render.intermediate.ArcToBezierCurveTransformerTestCase
Running org.apache.fop.render.intermediate.BorderPainterTestCase
Tests run: 7, Failures: 0, Errors: 0, Skipped: 0, Time elapsed: 0.079
sec - in org.apache.fop.render.intermediate.BorderPainterTestCase
Running org.apache.fop.render.intermediate.IFRendererTestCase
Tests run: 1, Failures: 0, Errors: 0, Skipped: 0, Time elapsed: 0.062
sec - in org.apache.fop.render.intermediate.IFRendererTestCase
Running org.apache.fop.render.intermediate.IFSerializerTestCase
Tests run: 3, Failures: 0, Errors: 0, Skipped: 0, Time elapsed: 0.003
sec - in org.apache.fop.render.intermediate.IFSerializerTestCase
Running org.apache.fop.render.intermediate.IFStructureTreeBuilderTestCase
Tests run: 4, Failures: 0, Errors: 0, Skipped: 0, Time elapsed: 0.015
sec - in org.apache.fop.render.intermediate.IFStructureTreeBuilderTestCase
Running org.apache.fop.render.intermediate.SAXEventRecorderTestCase
Tests run: 5, Failures: 0, Errors: 0, Skipped: 0, Time elapsed: 0.001
sec - in org.apache.fop.render.intermediate.SAXEventRecorderTestCase
Running org.apache.fop.render.intermediate.URIActionTestCase
Tests run: 1, Failures: 0, Errors: 0, Skipped: 0, Time elapsed: 0 sec -
in org.apache.fop.render.intermediate.URIActionTestCase
Running org.apache.fop.render.java2d.ConfiguredFontCollectionTestCase
Tests run: 1, Failures: 0, Errors: 0, Skipped: 0, Time elapsed: 0.021
sec - in org.apache.fop.render.java2d.ConfiguredFontCollectionTestCase
Running org.apache.fop.render.java2d.Java2DUtilTestCase
Tests run: 2, Failures: 0, Errors: 0, Skipped: 0, Time elapsed: 0.028
sec - in org.apache.fop.render.java2d.Java2DUtilTestCase
Running org.apache.fop.render.pcl.fonts.PCLByteWriterUtilTestCase
Tests run: 2, Failures: 0, Errors: 0, Skipped: 0, Time elapsed: 0 sec -
in org.apache.fop.render.pcl.fonts.PCLByteWriterUtilTestCase
Running org.apache.fop.render.pcl.fonts.PCLFontReaderFactoryTestCase
Tests run: 1, Failures: 0, Errors: 0, Skipped: 0, Time elapsed: 0.083
sec - in org.apache.fop.render.pcl.fonts.PCLFontReaderFactoryTestCase
Running org.apache.fop.render.pcl.fonts.PCLTTFFontReaderTestCase
Tests run: 1, Failures: 0, Errors: 0, Skipped: 0, Time elapsed: 0.015
sec - in org.apache.fop.render.pcl.fonts.PCLTTFFontReaderTestCase
Running
org.apache.fop.render.pcl.fonts.truetype.PCLTTFCharacterWriterTestCase
Tests run: 1, Failures: 0, Errors: 0, Skipped: 0, Time elapsed: 0.026
sec - in
org.apache.fop.render.pcl.fonts.truetype.PCLTTFCharacterWriterTestCase
Running org.apache.fop.render.pcl.PCLPainterTestCase
Tests run: 2, Failures: 0, Errors: 0, Skipped: 0, Time elapsed: 0.08 sec
- in org.apache.fop.render.pcl.PCLPainterTestCase
Running org.apache.fop.render.pcl.PCLRendererConfigParserTestCase
Tests run: 6, Failures: 0, Errors: 0, Skipped: 0, Time elapsed: 0.008
sec - in org.apache.fop.render.pcl.PCLRendererConfigParserTestCase
Running org.apache.fop.render.pcl.PCLRendererConfiguratorTestCase
Tests run: 5, Failures: 0, Errors: 0, Skipped: 0, Time elapsed: 0.014
sec - in org.apache.fop.render.pcl.PCLRendererConfiguratorTestCase
Running
org.apache.fop.render.pdf.extensions.PDFDocumentInformationElementTestCase
Tests run: 2, Failures: 0, Errors: 0, Skipped: 0, Time elapsed: 0.017
sec - in
org.apache.fop.render.pdf.extensions.PDFDocumentInformationElementTestCase
Running org.apache.fop.render.pdf.ImageRawPNGAdapterTestCase
Tests run: 9, Failures: 0, Errors: 0, Skipped: 0, Time elapsed: 0.038
sec - in org.apache.fop.render.pdf.ImageRawPNGAdapterTestCase
Running org.apache.fop.render.pdf.ImageRenderedAdapterTestCase
Tests run: 3, Failures: 0, Errors: 0, Skipped: 0, Time elapsed: 0.006
sec - in org.apache.fop.render.pdf.ImageRenderedAdapterTestCase
Running org.apache.fop.render.pdf.PDFAConformanceTestCase
Tests run: 7, Failures: 0, Errors: 0, Skipped: 0, Time elapsed: 0.097
sec - in org.apache.fop.render.pdf.PDFAConformanceTestCase
Running org.apache.fop.render.pdf.PDFAMetadataTestCase
Tests run: 2, Failures: 0, Errors: 0, Skipped: 0, Time elapsed: 0.001
sec - in org.apache.fop.render.pdf.PDFAMetadataTestCase
Running org.apache.fop.render.pdf.PDFBorderPainterTestCase
Tests run: 1, Failures: 0, Errors: 0, Skipped: 0, Time elapsed: 0 sec -
in org.apache.fop.render.pdf.PDFBorderPainterTestCase
Running org.apache.fop.render.pdf.PDFCMapTestCase
Tests run: 1, Failures: 0, Errors: 0, Skipped: 0, Time elapsed: 0 sec -
in org.apache.fop.render.pdf.PDFCMapTestCase
Running org.apache.fop.render.pdf.PDFDocumentHandlerTestCase
Tests run: 1, Failures: 0, Errors: 0, Skipped: 0, Time elapsed: 0 sec -
in org.apache.fop.render.pdf.PDFDocumentHandlerTestCase
Running org.apache.fop.render.pdf.PDFEncodingTestCase
Tests run: 3, Failures: 0, Errors: 0, Skipped: 0, Time elapsed: 0.526
sec - in org.apache.fop.render.pdf.PDFEncodingTestCase
Running org.apache.fop.render.pdf.PDFGraphicsPainterTestCase
Tests run: 12, Failures: 0, Errors: 0, Skipped: 0, Time elapsed: 0.011
sec - in org.apache.fop.render.pdf.PDFGraphicsPainterTestCase
Running org.apache.fop.render.pdf.PDFPainterTestCase
Tests run: 5, Failures: 0, Errors: 0, Skipped: 0, Time elapsed: 0.092
sec - in org.apache.fop.render.pdf.PDFPainterTestCase
Running org.apache.fop.render.pdf.PDFRendererConfigParserTestCase
Tests run: 13, Failures: 0, Errors: 0, Skipped: 0, Time elapsed: 0.202
sec - in org.apache.fop.render.pdf.PDFRendererConfigParserTestCase
Running org.apache.fop.render.pdf.PDFRendererConfiguratorTestCase
Tests run: 1, Failures: 0, Errors: 0, Skipped: 0, Time elapsed: 0.001
sec - in org.apache.fop.render.pdf.PDFRendererConfiguratorTestCase
Running org.apache.fop.render.pdf.PDFRendererOptionsConfigTestCase
Tests run: 3, Failures: 0, Errors: 0, Skipped: 0, Time elapsed: 0 sec -
in org.apache.fop.render.pdf.PDFRendererOptionsConfigTestCase
Running org.apache.fop.render.pdf.PDFsRGBSettingsTestCase
Tests run: 1, Failures: 0, Errors: 0, Skipped: 0, Time elapsed: 0.001
sec - in org.apache.fop.render.pdf.PDFsRGBSettingsTestCase
Running org.apache.fop.render.pdf.PDFStructureTreeBuilderTestCase
Tests run: 1, Failures: 0, Errors: 0, Skipped: 0, Time elapsed: 0 sec -
in org.apache.fop.render.pdf.PDFStructureTreeBuilderTestCase
Running org.apache.fop.render.ps.fonts.PSTTFGeneratorTestCase
Tests run: 4, Failures: 0, Errors: 0, Skipped: 0, Time elapsed: 0.008
sec - in org.apache.fop.render.ps.fonts.PSTTFGeneratorTestCase
Running org.apache.fop.render.ps.fonts.PSTTFGlyphOutputStreamTestCase
Tests run: 3, Failures: 0, Errors: 0, Skipped: 0, Time elapsed: 0.209
sec - in org.apache.fop.render.ps.fonts.PSTTFGlyphOutputStreamTestCase
Running org.apache.fop.render.ps.fonts.PSTTFOutputStreamTestCase
Tests run: 4, Failures: 0, Errors: 0, Skipped: 0, Time elapsed: 0.006
sec - in org.apache.fop.render.ps.fonts.PSTTFOutputStreamTestCase
Running org.apache.fop.render.ps.fonts.PSTTFTableOutputStreamTestCase
Tests run: 1, Failures: 0, Errors: 0, Skipped: 0, Time elapsed: 0.001
sec - in org.apache.fop.render.ps.fonts.PSTTFTableOutputStreamTestCase
Running org.apache.fop.render.ps.ImageEncoderPNGTestCase
Tests run: 7, Failures: 0, Errors: 0, Skipped: 0, Time elapsed: 0.004
sec - in org.apache.fop.render.ps.ImageEncoderPNGTestCase
Running org.apache.fop.render.ps.ImageHandlingTestCase
Tests run: 3, Failures: 0, Errors: 0, Skipped: 0, Time elapsed: 0.14 sec
- in org.apache.fop.render.ps.ImageHandlingTestCase
Running org.apache.fop.render.ps.PSBorderPainterTestCase
Tests run: 1, Failures: 0, Errors: 0, Skipped: 0, Time elapsed: 0 sec -
in org.apache.fop.render.ps.PSBorderPainterTestCase
Running org.apache.fop.render.ps.PSGraphics2DAdapterTestCase
Tests run: 1, Failures: 0, Errors: 0, Skipped: 0, Time elapsed: 0.005
sec - in org.apache.fop.render.ps.PSGraphics2DAdapterTestCase
Running org.apache.fop.render.ps.PSGraphicsPainterTestCase
Tests run: 1, Failures: 0, Errors: 0, Skipped: 0, Time elapsed: 0 sec -
in org.apache.fop.render.ps.PSGraphicsPainterTestCase
Running org.apache.fop.render.ps.PSImageUtilsTestCase
Tests run: 1, Failures: 0, Errors: 0, Skipped: 1, Time elapsed: 0.001
sec - in org.apache.fop.render.ps.PSImageUtilsTestCase
Running org.apache.fop.render.ps.PSPainterTestCase
Tests run: 5, Failures: 0, Errors: 0, Skipped: 0, Time elapsed: 0.03 sec
- in org.apache.fop.render.ps.PSPainterTestCase
Running org.apache.fop.render.ps.PSRendererConfigParserTestCase
Tests run: 5, Failures: 0, Errors: 0, Skipped: 0, Time elapsed: 0.008
sec - in org.apache.fop.render.ps.PSRendererConfigParserTestCase
Running org.apache.fop.render.ps.PSRendererConfiguratorTestCase
Tests run: 6, Failures: 0, Errors: 0, Skipped: 0, Time elapsed: 0.013
sec - in org.apache.fop.render.ps.PSRendererConfiguratorTestCase
Running org.apache.fop.render.ps.PSRenderingUtilTestCase
Tests run: 1, Failures: 0, Errors: 0, Skipped: 0, Time elapsed: 0 sec -
in org.apache.fop.render.ps.PSRenderingUtilTestCase
Running org.apache.fop.render.ps.ResourceOptimizationTestCase
Tests run: 1, Failures: 0, Errors: 0, Skipped: 0, Time elapsed: 0.041
sec - in org.apache.fop.render.ps.ResourceOptimizationTestCase
Running org.apache.fop.render.ps.svg.GradientTestCase
Tests run: 2, Failures: 2, Errors: 0, Skipped: 0, Time elapsed: 0.029
sec <<< FAILURE! - in org.apache.fop.render.ps.svg.GradientTestCase
testRadialGradient(org.apache.fop.render.ps.svg.GradientTestCase) Time
elapsed: 0.024 sec  <<< FAILURE!
org.junit.ComparisonFailure: expected:<...attern setcolorspace[
<<
/Type /Pattern
/PatternType 2
/Shading <<
/ShadingType 3
/ColorSpace /DeviceRGB
/Coords [ 840 180 0 840 180 16 ]
/Extend [ true true ]
/Function <<
/FunctionType 3
/Domain [ 0 1 ]
/Functions [ <<
/FunctionType 2
/Domain [ 0 1 ]
/C0 [ 1 1 1 ]
/C1 [ 1 1 1 ]
/N 1
 >> <<
/FunctionType 2
/Domain [ 0 1 ]
/C0 [ 1 1 1 ]
/C1 [ 0.784 0.784 0.784 ]
/N 1
 >> <<
/FunctionType 2
/Domain [ 0 1 ]
/C0 [ 0.784 0.784 0.784 ]
/C1 [ 0.667 0.667 0.667 ]
/N 1
 >> <<
/FunctionType 2
/Domain [ 0 1 ]
/C0 [ 0.667 0.667 0.667 ]
/C1 [ 0.549 0.549 0.549 ]
/N 1
 >> ]
/Encode [ 0 1 0 1 0 1 0 1 ]
/Bounds [ 0.2 0.6 0.8 ]
 >>
 >>
 >>
[ 1 0 0 1 0 0 ] makepattern setcolor
]
 > but was:<...attern setcolorspace[
<<
/Type /Pattern
/PatternType 2
/Shading <<
/ShadingType 3
/ColorSpace /DeviceRGB
/Coords [ 840 180 0 840 180 16 ]
/Extend [ true true ]
/Function <<
/FunctionType 3
/Domain [ 0 1 ]
/Functions [ <<
/FunctionType 2
/Domain [ 0 1 ]
/C0 [ 1 1 1 ]
/C1 [ 1 1 1 ]
/N 1
 >> <<
/FunctionType 2
/Domain [ 0 1 ]
/C0 [ 1 1 1 ]
/C1 [ 0.784 0.784 0.784 ]
/N 1
 >> <<
/FunctionType 2
/Domain [ 0 1 ]
/C0 [ 0.784 0.784 0.784 ]
/C1 [ 0.667 0.667 0.667 ]
/N 1
 >> <<
/FunctionType 2
/Domain [ 0 1 ]
/C0 [ 0.667 0.667 0.667 ]
/C1 [ 0.549 0.549 0.549 ]
/N 1
 >> ]
/Encode [ 0 1 0 1 0 1 0 1 ]
/Bounds [ 0.2 0.6 0.8 ]
 >>
 >>
 >>
[ 1 0 0 1 0 0 ] makepattern setcolor]
 >
     at org.junit.Assert.assertEquals(Assert.java:115)
     at org.junit.Assert.assertEquals(Assert.java:144)
     at
org.apache.fop.render.ps.svg.GradientTestCase.testGradientRendering(GradientTestCase.java:73)
     at
org.apache.fop.render.ps.svg.GradientTestCase.testRadialGradient(GradientTestCase.java:61)

testLinearGradient(org.apache.fop.render.ps.svg.GradientTestCase) Time
elapsed: 0.004 sec  <<< FAILURE!
org.junit.ComparisonFailure: expected:<...attern setcolorspace[
<<
/Type /Pattern
/PatternType 2
/Shading <<
/ShadingType 2
/ColorSpace /DeviceRGB
/Coords [ 115 285 15 15 ]
/Extend [ true true ]
/Function <<
/FunctionType 3
/Domain [ 0 1 ]
/Functions [ <<
/FunctionType 2
/Domain [ 0 1 ]
/C0 [ 1 1 0 ]
/C1 [ 1 0 0 ]
/N 1
 >> ]
/Encode [ 0 1 ]
/Bounds [ ]
 >>
 >>
 >>
[ 1 0 0 1 0 0 ] makepattern setcolor
]
 > but was:<...attern setcolorspace[
<<
/Type /Pattern
/PatternType 2
/Shading <<
/ShadingType 2
/ColorSpace /DeviceRGB
/Coords [ 115 285 15 15 ]
/Extend [ true true ]
/Function <<
/FunctionType 3
/Domain [ 0 1 ]
/Functions [ <<
/FunctionType 2
/Domain [ 0 1 ]
/C0 [ 1 1 0 ]
/C1 [ 1 0 0 ]
/N 1
 >> ]
/Encode [ 0 1 ]
/Bounds [ ]
 >>
 >>
 >>
[ 1 0 0 1 0 0 ] makepattern setcolor]
 >
     at org.junit.Assert.assertEquals(Assert.java:115)
     at org.junit.Assert.assertEquals(Assert.java:144)
     at
org.apache.fop.render.ps.svg.GradientTestCase.testGradientRendering(GradientTestCase.java:73)
     at
org.apache.fop.render.ps.svg.GradientTestCase.testLinearGradient(GradientTestCase.java:46)

Running org.apache.fop.render.RendererFactoryTestCase
Tests run: 3, Failures: 0, Errors: 0, Skipped: 0, Time elapsed: 0.001
sec - in org.apache.fop.render.RendererFactoryTestCase
Running org.apache.fop.render.rtf.Bug39607TestCase
Tests run: 1, Failures: 0, Errors: 0, Skipped: 0, Time elapsed: 0.007
sec - in org.apache.fop.render.rtf.Bug39607TestCase
Running org.apache.fop.render.rtf.TextAttributesConverterTestCase
Tests run: 1, Failures: 0, Errors: 0, Skipped: 0, Time elapsed: 0 sec -
in org.apache.fop.render.rtf.TextAttributesConverterTestCase
Running org.apache.fop.render.txt.TxtRendererConfigParserTestCase
Tests run: 1, Failures: 0, Errors: 0, Skipped: 0, Time elapsed: 0.002
sec - in org.apache.fop.render.txt.TxtRendererConfigParserTestCase
Running org.apache.fop.svg.font.BasicGlyphVectorTestCase
Tests run: 12, Failures: 0, Errors: 0, Skipped: 0, Time elapsed: 0.038
sec - in org.apache.fop.svg.font.BasicGlyphVectorTestCase
Running org.apache.fop.svg.font.FOPFontFamilyResolverTestCase
Tests run: 4, Failures: 0, Errors: 0, Skipped: 1, Time elapsed: 0.011
sec - in org.apache.fop.svg.font.FOPFontFamilyResolverTestCase
Running org.apache.fop.svg.font.FOPGVTFontTestCase
Tests run: 2, Failures: 0, Errors: 0, Skipped: 0, Time elapsed: 0.001
sec - in org.apache.fop.svg.font.FOPGVTFontTestCase
Running org.apache.fop.svg.font.GlyphLayoutTestCase
Tests run: 2, Failures: 0, Errors: 0, Skipped: 0, Time elapsed: 0.016
sec - in org.apache.fop.svg.font.GlyphLayoutTestCase
Running org.apache.fop.svg.font.KerningGlyphLayoutTestCase
Tests run: 1, Failures: 0, Errors: 0, Skipped: 0, Time elapsed: 0.002
sec - in org.apache.fop.svg.font.KerningGlyphLayoutTestCase
Running org.apache.fop.svg.PDFGraphics2DTestCase
Tests run: 2, Failures: 0, Errors: 0, Skipped: 0, Time elapsed: 0.001
sec - in org.apache.fop.svg.PDFGraphics2DTestCase
Running org.apache.fop.svg.PDFTextPainterTestCase
Tests run: 5, Failures: 0, Errors: 0, Skipped: 0, Time elapsed: 0.067
sec - in org.apache.fop.svg.PDFTextPainterTestCase
Running org.apache.fop.svg.PSTextPainterTestCase
Tests run: 1, Failures: 0, Errors: 0, Skipped: 0, Time elapsed: 0.009
sec - in org.apache.fop.svg.PSTextPainterTestCase
Running org.apache.fop.text.linebreak.LineBreakStatusTestCase
Tests run: 2, Failures: 0, Errors: 0, Skipped: 0, Time elapsed: 0 sec -
in org.apache.fop.text.linebreak.LineBreakStatusTestCase
Running org.apache.fop.text.linebreak.LineBreakUtilsTestCase
Tests run: 2, Failures: 0, Errors: 0, Skipped: 0, Time elapsed: 0.001
sec - in org.apache.fop.text.linebreak.LineBreakUtilsTestCase
Running org.apache.fop.traits.BorderPropsTestCase
Tests run: 2, Failures: 0, Errors: 0, Skipped: 0, Time elapsed: 0 sec -
in org.apache.fop.traits.BorderPropsTestCase
Running org.apache.fop.traits.MinOptMaxTestCase
Tests run: 20, Failures: 0, Errors: 0, Skipped: 0, Time elapsed: 0.001
sec - in org.apache.fop.traits.MinOptMaxTestCase
Running org.apache.fop.URIResolutionTestCase
Tests run: 2, Failures: 0, Errors: 0, Skipped: 0, Time elapsed: 0.023
sec - in org.apache.fop.URIResolutionTestCase
Running org.apache.fop.util.AdvancedMessageFormatTestCase
Tests run: 5, Failures: 0, Errors: 0, Skipped: 0, Time elapsed: 0.007
sec - in org.apache.fop.util.AdvancedMessageFormatTestCase
Running org.apache.fop.util.BitmapImageUtilTestCase
Tests run: 1, Failures: 0, Errors: 0, Skipped: 0, Time elapsed: 0.501
sec - in org.apache.fop.util.BitmapImageUtilTestCase
Running org.apache.fop.util.CharUtilitiesTestCase
Tests run: 5, Failures: 0, Errors: 0, Skipped: 0, Time elapsed: 0.043
sec - in org.apache.fop.util.CharUtilitiesTestCase
Running org.apache.fop.util.ColorUtilTestCase
Tests run: 8, Failures: 0, Errors: 0, Skipped: 0, Time elapsed: 0.047
sec - in org.apache.fop.util.ColorUtilTestCase
Running org.apache.fop.util.CompareUtilTestCase
Tests run: 1, Failures: 0, Errors: 0, Skipped: 0, Time elapsed: 0.014
sec - in org.apache.fop.util.CompareUtilTestCase
Running org.apache.fop.util.ElementListUtilsTestCase
Tests run: 4, Failures: 0, Errors: 0, Skipped: 0, Time elapsed: 0 sec -
in org.apache.fop.util.ElementListUtilsTestCase
Running org.apache.fop.util.HexEncoderTestCase
Tests run: 2, Failures: 0, Errors: 0, Skipped: 0, Time elapsed: 0.021
sec - in org.apache.fop.util.HexEncoderTestCase
Running org.apache.fop.util.LanguageTagsTestCase
Tests run: 4, Failures: 0, Errors: 0, Skipped: 0, Time elapsed: 0 sec -
in org.apache.fop.util.LanguageTagsTestCase
Running org.apache.fop.util.XMLResourceBundleTestCase
Tests run: 2, Failures: 0, Errors: 0, Skipped: 0, Time elapsed: 0 sec -
in org.apache.fop.util.XMLResourceBundleTestCase

Results :

Failed tests:
FO2StructureTreeConverterTestCase.testRemoveBlocks:142->compare:183
expected:<...cture-tree-sequence>[
<structure-tree xmlns="http://xmlgraphics.apache.org/fop/intermediate"
xmlns:foi="http://xmlgraphics.apache.org/fop/internal"
xmlns:fox="http://xmlgraphics.apache.org/fop/extensions">
<fo:flow xmlns:fo="http://www.w3.org/1999/XSL/Format"
flow-name="xsl-region-body">
<fo:block>
<marked-content/>
</fo:block>
</fo:flow>
</structure-tree>
</structure-tree-sequence>]
 > but was:<...cture-tree-sequence>[
<structure-tree xmlns="http://xmlgraphics.apache.org/fop/intermediate"
xmlns:foi="http://xmlgraphics.apache.org/fop/internal"
xmlns:fox="http://xmlgraphics.apache.org/fop/extensions">
<fo:flow xmlns:fo="http://www.w3.org/1999/XSL/Format"
flow-name="xsl-region-body">
<fo:block>
<marked-content/>
</fo:block>
</fo:flow>
</structure-tree>
</structure-tree-sequence>
]
 >
GradientTestCase.testLinearGradient:46->testGradientRendering:73
expected:<...attern setcolorspace[
<<
/Type /Pattern
/PatternType 2
/Shading <<
/ShadingType 2
/ColorSpace /DeviceRGB
/Coords [ 115 285 15 15 ]
/Extend [ true true ]
/Function <<
/FunctionType 3
/Domain [ 0 1 ]
/Functions [ <<
/FunctionType 2
/Domain [ 0 1 ]
/C0 [ 1 1 0 ]
/C1 [ 1 0 0 ]
/N 1
 >> ]
/Encode [ 0 1 ]
/Bounds [ ]
 >>
 >>
 >>
[ 1 0 0 1 0 0 ] makepattern setcolor
]
 > but was:<...attern setcolorspace[
<<
/Type /Pattern
/PatternType 2
/Shading <<
/ShadingType 2
/ColorSpace /DeviceRGB
/Coords [ 115 285 15 15 ]
/Extend [ true true ]
/Function <<
/FunctionType 3
/Domain [ 0 1 ]
/Functions [ <<
/FunctionType 2
/Domain [ 0 1 ]
/C0 [ 1 1 0 ]
/C1 [ 1 0 0 ]
/N 1
 >> ]
/Encode [ 0 1 ]
/Bounds [ ]
 >>
 >>
 >>
[ 1 0 0 1 0 0 ] makepattern setcolor]
 >
GradientTestCase.testRadialGradient:61->testGradientRendering:73
expected:<...attern setcolorspace[
<<
/Type /Pattern
/PatternType 2
/Shading <<
/ShadingType 3
/ColorSpace /DeviceRGB
/Coords [ 840 180 0 840 180 16 ]
/Extend [ true true ]
/Function <<
/FunctionType 3
/Domain [ 0 1 ]
/Functions [ <<
/FunctionType 2
/Domain [ 0 1 ]
/C0 [ 1 1 1 ]
/C1 [ 1 1 1 ]
/N 1
 >> <<
/FunctionType 2
/Domain [ 0 1 ]
/C0 [ 1 1 1 ]
/C1 [ 0.784 0.784 0.784 ]
/N 1
 >> <<
/FunctionType 2
/Domain [ 0 1 ]
/C0 [ 0.784 0.784 0.784 ]
/C1 [ 0.667 0.667 0.667 ]
/N 1
 >> <<
/FunctionType 2
/Domain [ 0 1 ]
/C0 [ 0.667 0.667 0.667 ]
/C1 [ 0.549 0.549 0.549 ]
/N 1
 >> ]
/Encode [ 0 1 0 1 0 1 0 1 ]
/Bounds [ 0.2 0.6 0.8 ]
 >>
 >>
 >>
[ 1 0 0 1 0 0 ] makepattern setcolor
]
 > but was:<...attern setcolorspace[
<<
/Type /Pattern
/PatternType 2
/Shading <<
/ShadingType 3
/ColorSpace /DeviceRGB
/Coords [ 840 180 0 840 180 16 ]
/Extend [ true true ]
/Function <<
/FunctionType 3
/Domain [ 0 1 ]
/Functions [ <<
/FunctionType 2
/Domain [ 0 1 ]
/C0 [ 1 1 1 ]
/C1 [ 1 1 1 ]
/N 1
 >> <<
/FunctionType 2
/Domain [ 0 1 ]
/C0 [ 1 1 1 ]
/C1 [ 0.784 0.784 0.784 ]
/N 1
 >> <<
/FunctionType 2
/Domain [ 0 1 ]
/C0 [ 0.784 0.784 0.784 ]
/C1 [ 0.667 0.667 0.667 ]
/N 1
 >> <<
/FunctionType 2
/Domain [ 0 1 ]
/C0 [ 0.667 0.667 0.667 ]
/C1 [ 0.549 0.549 0.549 ]
/N 1
 >> ]
/Encode [ 0 1 0 1 0 1 0 1 ]
/Bounds [ 0.2 0.6 0.8 ]
 >>
 >>
 >>
[ 1 0 0 1 0 0 ] makepattern setcolor]
 >

Tests run: 3214, Failures: 3, Errors: 0, Skipped: 4

[INFO]
------------------------------------------------------------------------
[INFO] Reactor Summary for Apache FOP Parent 2.5.0-SNAPSHOT:
[INFO]
[INFO] Apache FOP Parent .................................. SUCCESS [  
0.291 s]
[INFO] Apache FOP Utilities ............................... SUCCESS [  
1.297 s]
[INFO] Apache FOP Events .................................. SUCCESS [  
1.223 s]
[INFO] Apache FOP Core .................................... FAILURE
[01:57 min]
[INFO] Apache FOP All-In-One .............................. SKIPPED
[INFO] Apache FOP Sandbox ................................. SKIPPED
[INFO] Apache FOP Servlet ................................. SKIPPED
[INFO] Apache FOP Transcoder .............................. SKIPPED
[INFO] Apache FOP Transcoder All-In-One ................... SKIPPED
[INFO]
------------------------------------------------------------------------
[INFO] BUILD FAILURE
[INFO]
------------------------------------------------------------------------
[INFO] Total time:  02:00 min
[INFO] Finished at: 2020-03-18T15:43:36+01:00
[INFO]
------------------------------------------------------------------------
[ERROR] Failed to execute goal
org.apache.maven.plugins:maven-surefire-plugin:2.18.1:test
(default-test) on project fop-core: There are test failures.
[ERROR]
[ERROR] Please refer to
D:\git\xmlgraphics-fop\fop-core\target\surefire-reports for the
individual test results.
[ERROR] -> [Help 1]
[ERROR]
[ERROR] To see the full stack trace of the errors, re-run Maven with the
-e switch.
[ERROR] Re-run Maven using the -X switch to enable full debug logging.
[ERROR]
[ERROR] For more information about the errors and possible solutions,
please read the following articles:
[ERROR] [Help 1]
http://cwiki.apache.org/confluence/display/MAVEN/MojoFailureException
[ERROR]
[ERROR] After correcting the problems, you can resume the build with the
command
[ERROR]   mvn <args> -rf :fop-core
=================
MAVEN BUILD REPORT
===================

--
Jean-François MAUREL
PIMECA
http://www.pimeca.com

 


---------------------------------------------------------------------
To unsubscribe, e-mail: [hidden email]
For additional commands, e-mail: [hidden email]



---------------------------------------------------------------------
To unsubscribe, e-mail: [hidden email]
For additional commands, e-mail: [hidden email]

Reply | Threaded
Open this post in threaded view
|

Re: build error in fop-trunk

jfrm.maurel@gmail.com
In reply to this post by jfrm.maurel@gmail.com

Hi Simon,

Thank you for your suggestion.

Le 18/03/2020 à 16:33, Simon Steiner a écrit :
> mvn clean install -DskipTests
This one works however as I am trying to learn I would prefer a clean build.

Regards

--
Jean-François MAUREL
PIMECA
http://www.pimeca.com


---------------------------------------------------------------------
To unsubscribe, e-mail: [hidden email]
For additional commands, e-mail: [hidden email]

Reply | Threaded
Open this post in threaded view
|

RE: build error in fop-trunk

Simon Steiner
Hi,

I've fixed one of your failures, the other tests were passing for me on windows.

Thanks

-----Original Message-----
From: [hidden email] <[hidden email]>
Sent: 18 March 2020 17:17
To: [hidden email]
Subject: Re: build error in fop-trunk


Hi Simon,

Thank you for your suggestion.

Le 18/03/2020 à 16:33, Simon Steiner a écrit :
> mvn clean install -DskipTests
This one works however as I am trying to learn I would prefer a clean build.

Regards

--
Jean-François MAUREL
PIMECA
http://www.pimeca.com


---------------------------------------------------------------------
To unsubscribe, e-mail: [hidden email]
For additional commands, e-mail: [hidden email]



---------------------------------------------------------------------
To unsubscribe, e-mail: [hidden email]
For additional commands, e-mail: [hidden email]

Reply | Threaded
Open this post in threaded view
|

RE: build error in fop-trunk

Simon Steiner
Hi,

I fixed the other failure now.

Thanks

-----Original Message-----
From: Simon Steiner <[hidden email]>
Sent: 02 April 2020 12:21
To: [hidden email]; [hidden email]
Subject: RE: build error in fop-trunk

Hi,

I've fixed one of your failures, the other tests were passing for me on windows.

Thanks

-----Original Message-----
From: [hidden email] <[hidden email]>
Sent: 18 March 2020 17:17
To: [hidden email]
Subject: Re: build error in fop-trunk


Hi Simon,

Thank you for your suggestion.

Le 18/03/2020 à 16:33, Simon Steiner a écrit :
> mvn clean install -DskipTests
This one works however as I am trying to learn I would prefer a clean build.

Regards

--
Jean-François MAUREL
PIMECA
http://www.pimeca.com


---------------------------------------------------------------------
To unsubscribe, e-mail: [hidden email]
For additional commands, e-mail: [hidden email]




---------------------------------------------------------------------
To unsubscribe, e-mail: [hidden email]
For additional commands, e-mail: [hidden email]