Build failed in Jenkins: xmlgraphics-fop-ant #449

classic Classic list List threaded Threaded
2 messages Options
Reply | Threaded
Open this post in threaded view
|

Build failed in Jenkins: xmlgraphics-fop-ant #449

Apache Jenkins Server
See <https://builds.apache.org/job/xmlgraphics-fop-ant/449/display/redirect>

Changes:


------------------------------------------
[...truncated 344.49 KB...]
    [junit]   [WARN ] Font "sans-serif,backslant,400" not found. Substituting with "sans-serif,normal,400".
    [junit]   [WARN ] Font "sans-serif,backslant,400" not found. Substituting with "sans-serif,normal,400".
    [junit]   [WARN ] Font "sans-serif,backslant,400" not found. Substituting with "sans-serif,normal,400".
    [junit]   [WARN ] Font "sans-serif,backslant,400" not found. Substituting with "sans-serif,normal,400".
    [junit]   [WARN ] Font "sans-serif,backslant,400" not found. Substituting with "sans-serif,normal,400".
    [junit]   [WARN ] Font "sans-serif,backslant,400" not found. Substituting with "sans-serif,normal,400".
    [junit]   [WARN ] Font "sans-serif,backslant,400" not found. Substituting with "sans-serif,normal,400".
    [junit]   [WARN ] Font "monospace,backslant,400" not found. Substituting with "monospace,normal,400".
    [junit]   [WARN ] Font "monospace,backslant,400" not found. Substituting with "monospace,normal,400".
    [junit]   [WARN ] Font "monospace,backslant,400" not found. Substituting with "monospace,normal,400".
    [junit]   [WARN ] Font "monospace,backslant,400" not found. Substituting with "monospace,normal,400".
    [junit]   [WARN ] Font "monospace,backslant,400" not found. Substituting with "monospace,normal,400".
    [junit]   [WARN ] Font "monospace,backslant,400" not found. Substituting with "monospace,normal,400".
    [junit]   [WARN ] Font "monospace,backslant,400" not found. Substituting with "monospace,normal,400".
    [junit] Test: table_overconstrained_ipd.xml
    [junit]   [WARN ] table-layout="fixed" and column-width unspecified => falling back to proportional-column-width(1) (No context info available)
    [junit]   [WARN ] table-layout="fixed" and column-width unspecified => falling back to proportional-column-width(1) (No context info available)
    [junit]   [WARN ] table-layout="fixed" and column-width unspecified => falling back to proportional-column-width(1) (No context info available)
    [junit]   [WARN ] The contents of fo:block line 3 exceed the available area in the inline-progression direction by more than 50 points. (No context info available)
    [junit]   [WARN ] The contents of fo:block line 2 exceed the available area in the inline-progression direction by more than 50 points. (No context info available)
    [junit]   [WARN ] The contents of fo:block line 1 exceed the available area in the inline-progression direction by 26688 millipoints. (No context info available)
    [junit] Test: list-block_writing-mode_rl.xml
    [junit]   [WARN ] The contents of fo:block line 1 exceed the available area in the inline-progression direction by 17344 millipoints. (No context info available)
    [junit]   [WARN ] The contents of fo:block line 1 exceed the available area in the inline-progression direction by 7344 millipoints. (No context info available)
    [junit] Test: region_display-align_table.xml
    [junit]   [WARN ] table-layout="fixed" and column-width unspecified => falling back to proportional-column-width(1) (No context info available)
    [junit]   [WARN ] table-layout="fixed" and column-width unspecified => falling back to proportional-column-width(1) (No context info available)
    [junit]   [WARN ] table-layout="fixed" and column-width unspecified => falling back to proportional-column-width(1) (No context info available)
    [junit]   [WARN ] table-layout="fixed" and column-width unspecified => falling back to proportional-column-width(1) (No context info available)
    [junit]   [WARN ] table-layout="fixed" and column-width unspecified => falling back to proportional-column-width(1) (No context info available)
    [junit]   [WARN ] table-layout="fixed" and column-width unspecified => falling back to proportional-column-width(1) (No context info available)
    [junit]   [WARN ] table-layout="fixed" and column-width unspecified => falling back to proportional-column-width(1) (No context info available)
    [junit]   [WARN ] table-layout="fixed" and column-width unspecified => falling back to proportional-column-width(1) (No context info available)
    [junit]   [WARN ] table-layout="fixed" and column-width unspecified => falling back to proportional-column-width(1) (No context info available)
    [junit]   [WARN ] table-layout="fixed" and column-width unspecified => falling back to proportional-column-width(1) (No context info available)
    [junit]   [WARN ] table-layout="fixed" and column-width unspecified => falling back to proportional-column-width(1) (No context info available)
    [junit]   [WARN ] table-layout="fixed" and column-width unspecified => falling back to proportional-column-width(1) (No context info available)
    [junit]   [WARN ] table-layout="fixed" and column-width unspecified => falling back to proportional-column-width(1) (No context info available)
    [junit]   [WARN ] table-layout="fixed" and column-width unspecified => falling back to proportional-column-width(1) (No context info available)
    [junit]   [WARN ] table-layout="fixed" and column-width unspecified => falling back to proportional-column-width(1) (No context info available)
    [junit] Test: simple-page-master_borders_padding.xml
    [junit]   [WARN ] Border and padding for fo:region-body "xsl-region-body" should be '0' (See 6.4.14 in XSL 1.1); non-standard values are allowed if relaxed validation is enabled.  (No context info available)
    [junit]   [WARN ] Border and padding for fo:region-before "xsl-region-before" should be '0' (See 6.4.14 in XSL 1.1); non-standard values are allowed if relaxed validation is enabled.  (No context info available)
    [junit]   [WARN ] Border and padding for fo:region-after "xsl-region-after" should be '0' (See 6.4.14 in XSL 1.1); non-standard values are allowed if relaxed validation is enabled.  (No context info available)
    [junit]   [WARN ] Border and padding for fo:region-start "xsl-region-start" should be '0' (See 6.4.14 in XSL 1.1); non-standard values are allowed if relaxed validation is enabled.  (No context info available)
    [junit] Test: table_padding_percentages.xml
    [junit]   [WARN ] table-layout="fixed" and column-width unspecified => falling back to proportional-column-width(1) (No context info available)
    [junit]   [WARN ] table-layout="fixed" and column-width unspecified => falling back to proportional-column-width(1) (No context info available)
    [junit]   [WARN ] table-layout="fixed" and column-width unspecified => falling back to proportional-column-width(1) (No context info available)
    [junit] Test: markers_10.xml
    [junit]   [WARN ] table-layout="fixed" and column-width unspecified => falling back to proportional-column-width(1) (No context info available)
    [junit] Test: bookmarks_2.xml
    [junit]   [WARN ] Font "Symbol,normal,700" not found. Substituting with "Symbol,normal,400".
    [junit]   [WARN ] Font "ZapfDingbats,normal,700" not found. Substituting with "ZapfDingbats,normal,400".
    [junit]   [WARN ] Font "Symbol,normal,700" not found. Substituting with "Symbol,normal,400".
    [junit]   [WARN ] Font "ZapfDingbats,normal,700" not found. Substituting with "ZapfDingbats,normal,400".
    [junit]   [WARN ] Font "Symbol,normal,700" not found. Substituting with "Symbol,normal,400".
    [junit]   [WARN ] Font "ZapfDingbats,normal,700" not found. Substituting with "ZapfDingbats,normal,400".
    [junit]   [WARN ] Font "Symbol,normal,700" not found. Substituting with "Symbol,normal,400".
    [junit]   [WARN ] Font "ZapfDingbats,normal,700" not found. Substituting with "ZapfDingbats,normal,400".
    [junit]   [WARN ] Font "Symbol,normal,700" not found. Substituting with "Symbol,normal,400".
    [junit]   [WARN ] Font "ZapfDingbats,normal,700" not found. Substituting with "ZapfDingbats,normal,400".
    [junit]   [WARN ] Font "Symbol,normal,700" not found. Substituting with "Symbol,normal,400".
    [junit]   [WARN ] Font "ZapfDingbats,normal,700" not found. Substituting with "ZapfDingbats,normal,400".
    [junit]   [WARN ] Font "Symbol,normal,700" not found. Substituting with "Symbol,normal,400".
    [junit]   [WARN ] Font "ZapfDingbats,normal,700" not found. Substituting with "ZapfDingbats,normal,400".
    [junit]   [WARN ] Font "Symbol,normal,700" not found. Substituting with "Symbol,normal,400".
    [junit]   [WARN ] Font "ZapfDingbats,normal,700" not found. Substituting with "ZapfDingbats,normal,400".
    [junit]   [WARN ] Font "Symbol,normal,700" not found. Substituting with "Symbol,normal,400".
    [junit]   [WARN ] Font "ZapfDingbats,normal,700" not found. Substituting with "ZapfDingbats,normal,400".
    [junit]   [WARN ] Font "Symbol,normal,700" not found. Substituting with "Symbol,normal,400".
    [junit]   [WARN ] Font "ZapfDingbats,normal,700" not found. Substituting with "ZapfDingbats,normal,400".
    [junit]   [WARN ] Font "Symbol,normal,700" not found. Substituting with "Symbol,normal,400".
    [junit]   [WARN ] Font "ZapfDingbats,normal,700" not found. Substituting with "ZapfDingbats,normal,400".
    [junit]   [WARN ] Font "Symbol,normal,700" not found. Substituting with "Symbol,normal,400".
    [junit]   [WARN ] Font "ZapfDingbats,normal,700" not found. Substituting with "ZapfDingbats,normal,400".
    [junit]   [WARN ] Font "Symbol,normal,700" not found. Substituting with "Symbol,normal,400".
    [junit]   [WARN ] Font "ZapfDingbats,normal,700" not found. Substituting with "ZapfDingbats,normal,400".
    [junit]   [WARN ] Font "Symbol,normal,700" not found. Substituting with "Symbol,normal,400".
    [junit]   [WARN ] Font "ZapfDingbats,normal,700" not found. Substituting with "ZapfDingbats,normal,400".
    [junit]   [WARN ] Font "Symbol,normal,700" not found. Substituting with "Symbol,normal,400".
    [junit]   [WARN ] Font "ZapfDingbats,normal,700" not found. Substituting with "ZapfDingbats,normal,400".
    [junit]   [WARN ] Font "Symbol,normal,700" not found. Substituting with "Symbol,normal,400".
    [junit]   [WARN ] Font "ZapfDingbats,normal,700" not found. Substituting with "ZapfDingbats,normal,400".
    [junit]   [WARN ] Font "Symbol,normal,700" not found. Substituting with "Symbol,normal,400".
    [junit]   [WARN ] Font "ZapfDingbats,normal,700" not found. Substituting with "ZapfDingbats,normal,400".
    [junit]   [WARN ] Font "Symbol,normal,700" not found. Substituting with "Symbol,normal,400".
    [junit]   [WARN ] Font "ZapfDingbats,normal,700" not found. Substituting with "ZapfDingbats,normal,400".
    [junit]   [WARN ] Font "Symbol,normal,700" not found. Substituting with "Symbol,normal,400".
    [junit]   [WARN ] Font "ZapfDingbats,normal,700" not found. Substituting with "ZapfDingbats,normal,400".
    [junit]   [WARN ] Font "Symbol,normal,700" not found. Substituting with "Symbol,normal,400".
    [junit]   [WARN ] Font "ZapfDingbats,normal,700" not found. Substituting with "ZapfDingbats,normal,400".
    [junit] Test: page-number-citation_writing-mode_rl_bug2789.xml
    [junit]   [WARN ] Font "Arial,normal,400" not found. Substituting with "any,normal,400".
    [junit]   [WARN ] Font "Arial,normal,400" not found. Substituting with "any,normal,400".
    [junit]   [WARN ] Font "Arial,normal,400" not found. Substituting with "any,normal,400".
    [junit]   [WARN ] Font "Arial,normal,400" not found. Substituting with "any,normal,400".
    [junit]   [WARN ] Font "Arial,normal,400" not found. Substituting with "any,normal,400".
    [junit]   [WARN ] Font "Arial,normal,400" not found. Substituting with "any,normal,400".
    [junit]   [WARN ] Font "Arial,normal,400" not found. Substituting with "any,normal,400".
    [junit]   [WARN ] Font "Arial,normal,400" not found. Substituting with "any,normal,400".
    [junit]   [WARN ] Font "Arial,normal,400" not found. Substituting with "any,normal,400".
    [junit]   [WARN ] Font "Arial,normal,400" not found. Substituting with "any,normal,400".
    [junit]   [WARN ] Font "Arial,normal,400" not found. Substituting with "any,normal,400".
    [junit]   [WARN ] Font "Arial,normal,400" not found. Substituting with "any,normal,400".
    [junit]   [WARN ] Font "Arial,normal,400" not found. Substituting with "any,normal,400".
    [junit]   [WARN ] Font "Arial,normal,400" not found. Substituting with "any,normal,400".
    [junit]   [WARN ] Font "Arial,normal,400" not found. Substituting with "any,normal,400".
    [junit]   [WARN ] Font "Arial,normal,400" not found. Substituting with "any,normal,400".
    [junit]   [WARN ] Font "Arial,normal,400" not found. Substituting with "any,normal,400".
    [junit]   [WARN ] Font "Arial,normal,400" not found. Substituting with "any,normal,400".
    [junit]   [WARN ] Font "Arial,normal,400" not found. Substituting with "any,normal,400".
    [junit]   [WARN ] Font "Arial,normal,400" not found. Substituting with "any,normal,400".
    [junit]   [WARN ] Font "Arial,normal,400" not found. Substituting with "any,normal,400".
    [junit]   [WARN ] Font "Arial,normal,400" not found. Substituting with "any,normal,400".
    [junit]   [WARN ] Font "Arial,normal,400" not found. Substituting with "any,normal,400".
    [junit]   [WARN ] Font "Arial,normal,400" not found. Substituting with "any,normal,400".
    [junit]   [WARN ] Font "Arial,normal,400" not found. Substituting with "any,normal,400".
    [junit]   [WARN ] Font "Arial,normal,400" not found. Substituting with "any,normal,400".
    [junit]   [WARN ] Font "Arial,normal,400" not found. Substituting with "any,normal,400".
    [junit]   [WARN ] Font "Arial,normal,400" not found. Substituting with "any,normal,400".
    [junit]   [WARN ] Font "Arial,normal,400" not found. Substituting with "any,normal,400".
    [junit]   [WARN ] Font "Arial,normal,400" not found. Substituting with "any,normal,400".
    [junit]   [WARN ] Font "Arial,normal,400" not found. Substituting with "any,normal,400".
    [junit]   [WARN ] Font "Arial,normal,400" not found. Substituting with "any,normal,400".
    [junit]   [WARN ] Font "Arial,normal,400" not found. Substituting with "any,normal,400".
    [junit]   [WARN ] Font "Arial,normal,400" not found. Substituting with "any,normal,400".
    [junit]   [WARN ] Font "Arial,normal,400" not found. Substituting with "any,normal,400".
    [junit]   [WARN ] Font "Arial,normal,400" not found. Substituting with "any,normal,400".
    [junit]   [WARN ] Font "Arial,normal,400" not found. Substituting with "any,normal,400".
    [junit]   [WARN ] Font "Arial,normal,400" not found. Substituting with "any,normal,400".
    [junit]   [WARN ] Font "Arial,normal,400" not found. Substituting with "any,normal,400".
    [junit]   [WARN ] Font "Arial,normal,400" not found. Substituting with "any,normal,400".
    [junit]   [WARN ] Font "Arial,normal,400" not found. Substituting with "any,normal,400".
    [junit]   [WARN ] Font "Arial,normal,400" not found. Substituting with "any,normal,400".
    [junit]   [WARN ] Font "Arial,normal,400" not found. Substituting with "any,normal,400".
    [junit]   [WARN ] Font "Arial,normal,400" not found. Substituting with "any,normal,400".
    [junit]   [WARN ] Font "Arial,normal,400" not found. Substituting with "any,normal,400".
    [junit]   [WARN ] Font "Arial,normal,400" not found. Substituting with "any,normal,400".
    [junit]   [WARN ] Font "Arial,normal,400" not found. Substituting with "any,normal,400".
    [junit]   [WARN ] Font "Arial,normal,400" not found. Substituting with "any,normal,400".
    [junit]   [WARN ] Font "Arial,normal,400" not found. Substituting with "any,normal,400".
    [junit]   [WARN ] Font "Arial,normal,400" not found. Substituting with "any,normal,400".
    [junit]   [WARN ] Font "Arial,normal,400" not found. Substituting with "any,normal,400".
    [junit]   [WARN ] Font "Arial,normal,400" not found. Substituting with "any,normal,400".
    [junit]   [WARN ] Font "Arial,normal,400" not found. Substituting with "any,normal,400".
    [junit]   [WARN ] Font "Arial,normal,400" not found. Substituting with "any,normal,400".
    [junit]   [WARN ] Font "Arial,normal,400" not found. Substituting with "any,normal,400".
    [junit]   [WARN ] Font "Arial,normal,400" not found. Substituting with "any,normal,400".
    [junit]   [WARN ] Glyph "?" (0x627, afii57415) not available in font "Times-Roman".
    [junit]   [WARN ] Glyph "?" (0x644, afii57444) not available in font "Times-Roman".
    [junit]   [WARN ] Glyph "?" (0x628, afii57416) not available in font "Times-Roman".
    [junit]   [WARN ] Glyph "?" (0x64a, afii57450) not available in font "Times-Roman".
    [junit]   [WARN ] Glyph "?" (0x646, afii57446) not available in font "Times-Roman".
    [junit]   [WARN ] Glyph "?" (0x62a, afii57418) not available in font "Times-Roman".
    [junit]   [WARN ] Font "Arial,normal,400" not found. Substituting with "any,normal,400".
    [junit]   [WARN ] Font "Arial,normal,400" not found. Substituting with "any,normal,400".
    [junit]   [WARN ] Font "Arial,normal,400" not found. Substituting with "any,normal,400".
    [junit] Test: table_border_padding_3.xml
    [junit]   [WARN ] page-position="last" master reference missing. (No context info available)
    [junit] ------------- ---------------- ---------------
    [junit] Testsuite: org.apache.fop.layoutmgr.BreakElementTestCase
    [junit] Tests run: 1, Failures: 0, Errors: 0, Skipped: 0, Time elapsed: 0.001 sec
    [junit]
    [junit] Testsuite: org.apache.fop.layoutmgr.PageSequenceLayoutManagerTestCase
    [junit] Tests run: 3, Failures: 0, Errors: 0, Skipped: 0, Time elapsed: 0.089 sec
    [junit]
    [junit] Testsuite: org.apache.fop.layoutmgr.RetrieveTableMarkerLayoutManagerMakerTestCase
    [junit] Tests run: 1, Failures: 0, Errors: 0, Skipped: 0, Time elapsed: 0.006 sec
    [junit]
    [junit] Testsuite: org.apache.fop.layoutmgr.RetrieveTableMarkerLayoutManagerTestCase
    [junit] Tests run: 1, Failures: 0, Errors: 0, Skipped: 0, Time elapsed: 0.079 sec
    [junit]
    [junit] Testsuite: org.apache.fop.layoutmgr.table.TableCellLayoutManagerTestCase
    [junit] Tests run: 1, Failures: 0, Errors: 0, Skipped: 0, Time elapsed: 0.116 sec
    [junit]
    [junit] Testsuite: org.apache.fop.layoutmgr.table.TableContentLayoutManagerTestCase
    [junit] Tests run: 1, Failures: 0, Errors: 0, Skipped: 0, Time elapsed: 0.011 sec
    [junit]
    [junit] Testsuite: org.apache.fop.layoutmgr.table.TableLayoutManagerTestCase
    [junit] Tests run: 2, Failures: 0, Errors: 0, Skipped: 0, Time elapsed: 0.03 sec
    [junit]
    [junit] Testsuite: org.apache.fop.pdf.AbstractPDFStreamTestCase
    [junit] Tests run: 10, Failures: 0, Errors: 0, Skipped: 0, Time elapsed: 0.016 sec
    [junit]
    [junit] Testsuite: org.apache.fop.pdf.FileIDGeneratorTestCase
    [junit] Tests run: 8, Failures: 0, Errors: 0, Skipped: 0, Time elapsed: 0.005 sec
    [junit]
    [junit] Testsuite: org.apache.fop.pdf.ObjectStreamManagerTestCase
    [junit] Tests run: 1, Failures: 0, Errors: 0, Skipped: 0, Time elapsed: 0.004 sec
    [junit]
    [junit] Testsuite: org.apache.fop.pdf.ObjectStreamTestCase
    [junit] Tests run: 4, Failures: 0, Errors: 0, Skipped: 0, Time elapsed: 0.002 sec
    [junit]
    [junit] Testsuite: org.apache.fop.pdf.PDFAModeTestCase
    [junit] Tests run: 6, Failures: 0, Errors: 0, Skipped: 0, Time elapsed: 0.002 sec
    [junit]
    [junit] Testsuite: org.apache.fop.pdf.PDFArrayTestCase
    [junit] Tests run: 15, Failures: 0, Errors: 0, Skipped: 0, Time elapsed: 0.005 sec
    [junit]
    [junit] Testsuite: org.apache.fop.pdf.PDFAttachmentTestCase
    [junit] Tests run: 3, Failures: 0, Errors: 0, Skipped: 0, Time elapsed: 0.044 sec
    [junit]
    [junit] Testsuite: org.apache.fop.pdf.PDFDestsTestCase
    [junit] Tests run: 10, Failures: 0, Errors: 0, Skipped: 0, Time elapsed: 0.003 sec
    [junit]
    [junit] Testsuite: org.apache.fop.pdf.PDFDictionaryTestCase
    [junit] Tests run: 13, Failures: 0, Errors: 0, Skipped: 0, Time elapsed: 0.004 sec
    [junit]
    [junit] Testsuite: org.apache.fop.pdf.PDFDocumentGraphics2DTestCase
    [junit] Tests run: 1, Failures: 0, Errors: 0, Skipped: 0, Time elapsed: 0.003 sec
    [junit]
    [junit] Testsuite: org.apache.fop.pdf.PDFDocumentTestCase
    [junit] Tests run: 1, Failures: 0, Errors: 0, Skipped: 0, Time elapsed: 0.001 sec
    [junit]
    [junit] Testsuite: org.apache.fop.pdf.PDFEncodingTestCase
    [junit] Tests run: 4, Failures: 0, Errors: 0, Skipped: 0, Time elapsed: 0.002 sec
    [junit]
    [junit] Testsuite: org.apache.fop.pdf.PDFEncryptionJCETestCase
    [junit] Tests run: 11, Failures: 0, Errors: 1, Skipped: 0, Time elapsed: 0.61 sec
    [junit]
    [junit] Testcase: testAES256(org.apache.fop.pdf.PDFEncryptionJCETestCase): Caused an ERROR
    [junit] java.security.InvalidKeyException: Illegal key size
    [junit] java.lang.IllegalStateException: java.security.InvalidKeyException: Illegal key size
    [junit] at org.apache.fop.pdf.PDFEncryptionJCE.initCipher(PDFEncryptionJCE.java:792)
    [junit] at org.apache.fop.pdf.PDFEncryptionJCE.encryptWithKey(PDFEncryptionJCE.java:759)
    [junit] at org.apache.fop.pdf.PDFEncryptionJCE.access$800(PDFEncryptionJCE.java:43)
    [junit] at org.apache.fop.pdf.PDFEncryptionJCE$Rev5Engine.computeUEValue(PDFEncryptionJCE.java:578)
    [junit] at org.apache.fop.pdf.PDFEncryptionJCE$Rev5Engine.run(PDFEncryptionJCE.java:476)
    [junit] at org.apache.fop.pdf.PDFEncryptionJCE$EncryptionInitializer.init(PDFEncryptionJCE.java:84)
    [junit] at org.apache.fop.pdf.PDFEncryptionJCE.<init>(PDFEncryptionJCE.java:682)
    [junit] at org.apache.fop.pdf.PDFEncryptionJCE.make(PDFEncryptionJCE.java:696)
    [junit] at org.apache.fop.pdf.PDFEncryptionJCETestCase.createEncryptionObject(PDFEncryptionJCETestCase.java:611)
    [junit] at org.apache.fop.pdf.PDFEncryptionJCETestCase.testAES256(PDFEncryptionJCETestCase.java:468)
    [junit] Caused by: java.security.InvalidKeyException: Illegal key size
    [junit] at javax.crypto.Cipher.checkCryptoPerm(Cipher.java:1029)
    [junit] at javax.crypto.Cipher.implInit(Cipher.java:795)
    [junit] at javax.crypto.Cipher.chooseProvider(Cipher.java:854)
    [junit] at javax.crypto.Cipher.init(Cipher.java:1374)
    [junit] at javax.crypto.Cipher.init(Cipher.java:1308)
    [junit] at org.apache.fop.pdf.PDFEncryptionJCE.initCipher(PDFEncryptionJCE.java:789)
    [junit]
    [junit]

BUILD FAILED
<https://builds.apache.org/job/xmlgraphics-fop-ant/ws/fop/build.xml>:770: Tests failed

Total time: 3 minutes 22 seconds
Build step 'Execute shell' marked build as failure
Reply | Threaded
Open this post in threaded view
|

Jenkins build is back to normal : xmlgraphics-fop-ant #450

Apache Jenkins Server