Build failed in Jenkins: xmlgraphics-fop-ant #438

classic Classic list List threaded Threaded
4 messages Options
Reply | Threaded
Open this post in threaded view
|

Build failed in Jenkins: xmlgraphics-fop-ant #438

Apache Jenkins Server
See <https://builds.apache.org/job/xmlgraphics-fop-ant/438/display/redirect?page=changes>

Changes:

[ssteiner] Update urls


------------------------------------------
[...truncated 972.32 KB...]
 [findbugs]   java.io.PrintStream
 [findbugs]   java.io.FileInputStream
 [findbugs]   java.io.InputStream
 [findbugs]   java.lang.UnsupportedOperationException
 [findbugs]   java.util.Map$Entry
 [findbugs]   java.awt.geom.Rectangle2D$Double
 [findbugs]   java.text.NumberFormat
 [findbugs]   java.text.DecimalFormatSymbols
 [findbugs]   java.text.DecimalFormat
 [findbugs]   java.nio.CharBuffer
 [findbugs]   java.lang.reflect.Constructor
 [findbugs]   java.util.regex.Matcher
 [findbugs]   java.math.RoundingMode
 [findbugs]   java.awt.geom.Dimension2D
 [findbugs]   java.math.BigDecimal
 [findbugs]   java.lang.Long
 [findbugs]   java.net.URL
 [findbugs]   java.net.URLConnection
 [findbugs]   java.io.StringWriter
 [findbugs]   java.io.ObjectInputStream
 [findbugs]   java.text.CharacterIterator
 [findbugs]   java.util.LinkedHashMap
 [findbugs]   java.io.FileOutputStream
 [findbugs]   java.io.BufferedOutputStream
 [findbugs]   java.io.File
 [findbugs]   java.net.MalformedURLException
 [findbugs]   java.io.InputStreamReader
 [findbugs]   java.io.BufferedReader
 [findbugs]   java.io.ObjectOutputStream
 [findbugs]   java.io.FileReader
 [findbugs]   java.lang.ref.WeakReference
 [findbugs]   java.security.MessageDigest
 [findbugs]   java.text.SimpleDateFormat
 [findbugs]   java.util.Date
 [findbugs]   java.text.DateFormat
 [findbugs]   java.awt.color.ICC_Profile
 [findbugs]   java.awt.geom.Area
 [findbugs]   java.awt.geom.GeneralPath
 [findbugs]   java.awt.image.BufferedImage
 [findbugs]   java.lang.Runtime
 [findbugs]   java.io.PrintWriter
 [findbugs]   java.util.StringTokenizer
 [findbugs]   java.io.BufferedInputStream
 [findbugs]   java.io.FileWriter
 [findbugs]   java.util.BitSet
 [findbugs]   java.util.SortedSet
 [findbugs]   java.io.DataOutputStream
 [findbugs]   java.awt.color.ICC_ColorSpace
 [findbugs]   java.awt.font.FontRenderContext
 [findbugs]   java.awt.Font
 [findbugs]   java.io.StringReader
 [findbugs]   java.util.NoSuchElementException
 [findbugs]   java.util.SortedMap
 [findbugs]   java.util.EnumMap
 [findbugs]   java.util.WeakHashMap
 [findbugs]   java.net.URISyntaxException
 [findbugs]   java.awt.RenderingHints
 [findbugs]   java.awt.image.ComponentColorModel
 [findbugs]   java.awt.image.Raster
 [findbugs]   java.security.SecureRandom
 [findbugs]   javax.crypto.CipherOutputStream
 [findbugs]   java.lang.NumberFormatException
 [findbugs]   java.awt.image.RenderedImage
 [findbugs]   java.awt.image.ColorModel
 [findbugs]   java.awt.image.WritableRaster
 [findbugs]   java.lang.Byte
 [findbugs]   javax.imageio.ImageIO
 [findbugs]   java.io.ByteArrayInputStream
 [findbugs]   java.util.TreeSet
 [findbugs]   java.util.Random
 [findbugs]   java.nio.IntBuffer
 [findbugs]   java.awt.Component
 [findbugs]   java.awt.Frame
 [findbugs]   java.awt.event.WindowEvent
 [findbugs]   java.awt.event.ActionEvent
 [findbugs]   javax.swing.JButton
 [findbugs]   javax.swing.JLabel
 [findbugs]   javax.swing.ImageIcon
 [findbugs]   java.awt.BorderLayout
 [findbugs]   java.awt.FlowLayout
 [findbugs]   javax.swing.border.EmptyBorder
 [findbugs]   java.awt.GridLayout
 [findbugs]   java.io.EOFException
 [findbugs]   java.awt.BasicStroke
 [findbugs]   java.awt.geom.Line2D$Float
 [findbugs]   java.awt.font.GlyphVector
 [findbugs]   java.awt.geom.Line2D
 [findbugs]   java.util.Vector
 [findbugs]   java.lang.InstantiationException
 [findbugs]   java.lang.IllegalAccessException
 [findbugs]   java.lang.NoSuchMethodException
 [findbugs]   java.lang.reflect.InvocationTargetException
 [findbugs]   java.util.concurrent.ConcurrentHashMap
 [findbugs]   java.util.concurrent.atomic.AtomicInteger
 [findbugs]   java.util.concurrent.locks.ReentrantLock
 [findbugs]   java.util.concurrent.ConcurrentMap
 [findbugs]   java.util.concurrent.locks.Lock
 [findbugs]   java.util.LinkedHashSet
 [findbugs]   java.text.StringCharacterIterator
 [findbugs]   java.awt.geom.Point2D$Float
 [findbugs]   java.awt.Shape
 [findbugs]   java.lang.reflect.Method
 [findbugs]   java.lang.ClassLoader
 [findbugs]   java.util.Scanner
 [findbugs]   java.lang.Package
 [findbugs]   java.lang.ClassNotFoundException
 [findbugs]   java.util.Properties
 [findbugs]   java.awt.image.IndexColorModel
 [findbugs]   java.io.BufferedWriter
 [findbugs]   java.io.OutputStreamWriter
 [findbugs]   java.security.AccessController
 [findbugs]   java.awt.Toolkit
 [findbugs]   java.awt.Container
 [findbugs]   javax.swing.KeyStroke
 [findbugs]   javax.swing.InputMap
 [findbugs]   javax.swing.ActionMap
 [findbugs]   javax.swing.JComboBox
 [findbugs]   javax.swing.JMenuBar
 [findbugs]   javax.swing.JToolBar
 [findbugs]   javax.swing.BorderFactory
 [findbugs]   java.awt.GridBagLayout
 [findbugs]   java.awt.Insets
 [findbugs]   java.awt.GridBagConstraints
 [findbugs]   java.awt.event.WindowListener
 [findbugs]   javax.swing.JMenu
 [findbugs]   javax.swing.ButtonGroup
 [findbugs]   javax.swing.JRadioButtonMenuItem
 [findbugs]   java.awt.print.PrinterJob
 [findbugs]   java.awt.print.PrinterException
 [findbugs]   javax.swing.SwingUtilities
 [findbugs]   javax.swing.JOptionPane
 [findbugs]   java.util.Objects
 [findbugs]   java.awt.image.DataBufferByte
 [findbugs]   java.awt.image.MultiPixelPackedSampleModel
 [findbugs]   java.awt.image.DataBufferInt
 [findbugs]   java.awt.image.SinglePixelPackedSampleModel
 [findbugs]   java.io.DataInputStream
 [findbugs]   java.awt.Graphics
 [findbugs]   java.lang.ref.Reference
 [findbugs]   java.lang.ref.SoftReference
 [findbugs]   java.text.AttributedString
 [findbugs]   java.io.LineNumberReader
 [findbugs]   java.awt.geom.Ellipse2D$Double
 [findbugs]   java.awt.geom.PathIterator
 [findbugs]   java.awt.geom.Ellipse2D
 [findbugs]   java.awt.Image
 [findbugs]   java.net.URLClassLoader
 [findbugs]   javax.swing.UIManager
 [findbugs]   java.util.MissingResourceException
 [findbugs]   java.lang.reflect.Proxy
 [findbugs]   java.lang.Throwable
 [findbugs]   java.awt.font.TextAttribute
 [findbugs]   java.awt.font.LineMetrics
 [findbugs]   java.awt.FontMetrics
 [findbugs]   java.awt.font.TextLayout
 [findbugs]   java.lang.Character$UnicodeBlock
 [findbugs]   java.util.zip.Deflater
 [findbugs]   java.util.zip.DeflaterOutputStream
 [findbugs]   java.util.zip.Inflater
 [findbugs]   java.util.zip.InflaterInputStream
 [findbugs]   java.lang.Error
 [findbugs]   java.io.UnsupportedEncodingException
 [findbugs]   java.util.UUID
 [findbugs]   java.util.TimeZone
 [findbugs]   javax.swing.border.Border
 [findbugs]   java.lang.Short
 [findbugs]   java.util.Hashtable
 [findbugs]   java.lang.Process
 [findbugs]   java.io.DataInput
 [findbugs]   java.text.ChoiceFormat
 [findbugs]   java.awt.image.ColorConvertOp
 [findbugs]   java.security.NoSuchAlgorithmException
 [findbugs]   javax.crypto.Cipher
 [findbugs]   javax.crypto.IllegalBlockSizeException
 [findbugs]   javax.crypto.BadPaddingException
 [findbugs]   javax.crypto.spec.SecretKeySpec
 [findbugs]   javax.crypto.spec.IvParameterSpec
 [findbugs]   java.awt.image.DataBuffer
 [findbugs]   java.awt.GraphicsConfigTemplate
 [findbugs]   javax.swing.JTextField
 [findbugs]   java.lang.StringIndexOutOfBoundsException
 [findbugs]   javax.swing.JScrollPane
 [findbugs]   javax.swing.JViewport
 [findbugs]   javax.swing.JScrollBar
 [findbugs]   javax.swing.event.EventListenerList
 [findbugs]   java.awt.event.AdjustmentEvent
 [findbugs]   java.awt.Adjustable
 [findbugs]   java.security.Security
 [findbugs]   java.nio.charset.CodingErrorAction
 [findbugs]   java.nio.charset.Charset
 [findbugs]   java.nio.charset.CharsetEncoder
 [findbugs]   java.nio.ByteBuffer
 [findbugs]   java.awt.image.PixelInterleavedSampleModel
 [findbugs]   java.awt.GraphicsEnvironment
 [findbugs]   java.awt.event.MouseEvent
 [findbugs]   java.awt.Stroke
 [findbugs]   java.awt.GradientPaint
 [findbugs]   java.awt.image.DirectColorModel
 [findbugs]   java.awt.Paint
 [findbugs]   java.awt.PaintContext
 [findbugs]   java.awt.image.renderable.RenderableImage
 [findbugs]   java.lang.ArithmeticException
 [findbugs]   java.nio.ByteOrder
 [findbugs]   java.lang.NoSuchFieldError
 [findbugs]   java.lang.IllegalAccessError
 [findbugs]   java.lang.NoSuchMethodError
 [findbugs]   java.lang.IncompatibleClassChangeError
 [findbugs]   java.lang.UnsatisfiedLinkError
 [findbugs]   java.lang.AbstractMethodError
 [findbugs]   java.lang.NegativeArraySizeException
 [findbugs]   java.io.ObjectStreamException
 [findbugs]   java.lang.CloneNotSupportedException
 [findbugs]   java.lang.ClassFormatError
 [findbugs]   java.lang.VerifyError
 [findbugs]   java.lang.ExceptionInInitializerError
 [findbugs]   java.lang.ClassCastException
 [findbugs]   java.lang.LinkageError
 [findbugs]   javax.swing.Action
 [findbugs]   java.util.Arrays$ArrayList
 [findbugs]   java.awt.Transparency
 [findbugs]   java.awt.image.SampleModel
 [findbugs]   java.lang.NoClassDefFoundError
 [findbugs]   java.nio.charset.CharacterCodingException
 [findbugs]   java.awt.AWTEvent
 [findbugs]   java.awt.FontFormatException
 [findbugs]   javax.swing.WindowConstants
 [findbugs]   javax.swing.JComponent
 [findbugs]   java.awt.event.KeyEvent
 [findbugs]   java.text.AttributedCharacterIterator$Attribute
 [findbugs]   java.security.InvalidKeyException
 [findbugs]   javax.crypto.NoSuchPaddingException
 [findbugs]   java.security.InvalidAlgorithmParameterException
 [findbugs] Warnings generated: 4
 [findbugs] Missing classes: 290
 [findbugs] Calculating exit code...
 [findbugs] Setting 'missing class' flag (2)
 [findbugs] Setting 'bugs found' flag (1)
 [findbugs] Exit code set to: 3
 [findbugs] Java Result: 3
 [findbugs] Classes needed for analysis were missing
 [findbugs] Output saved to <https://builds.apache.org/job/xmlgraphics-fop-ant/ws/fop/build/report_findbugs.html>

BUILD FAILED
<https://builds.apache.org/job/xmlgraphics-fop-ant/ws/fop/build.xml>:1127: The following error occurred while executing this line:
<https://builds.apache.org/job/xmlgraphics-fop-ant/ws/fop/build.xml>:1117: if=findbugs.warnings

Total time: 5 minutes 17 seconds
Build step 'Execute shell' marked build as failure
No JDK named ?jdk-1.7.0_79 (unlimited security)? found
Reply | Threaded
Open this post in threaded view
|

Build failed in Jenkins: xmlgraphics-fop-ant #439

Apache Jenkins Server
See <https://builds.apache.org/job/xmlgraphics-fop-ant/439/display/redirect>

Changes:


------------------------------------------
[...truncated 326.55 KB...]
    [junit]   [WARN ] Font "sans-serif,backslant,400" not found. Substituting with "sans-serif,normal,400".
    [junit]   [WARN ] Font "sans-serif,backslant,400" not found. Substituting with "sans-serif,normal,400".
    [junit]   [WARN ] Font "sans-serif,backslant,400" not found. Substituting with "sans-serif,normal,400".
    [junit]   [WARN ] Font "sans-serif,backslant,400" not found. Substituting with "sans-serif,normal,400".
    [junit]   [WARN ] Font "sans-serif,backslant,400" not found. Substituting with "sans-serif,normal,400".
    [junit]   [WARN ] Font "sans-serif,backslant,400" not found. Substituting with "sans-serif,normal,400".
    [junit]   [WARN ] Font "sans-serif,backslant,400" not found. Substituting with "sans-serif,normal,400".
    [junit]   [WARN ] Font "monospace,backslant,400" not found. Substituting with "monospace,normal,400".
    [junit]   [WARN ] Font "monospace,backslant,400" not found. Substituting with "monospace,normal,400".
    [junit]   [WARN ] Font "monospace,backslant,400" not found. Substituting with "monospace,normal,400".
    [junit]   [WARN ] Font "monospace,backslant,400" not found. Substituting with "monospace,normal,400".
    [junit]   [WARN ] Font "monospace,backslant,400" not found. Substituting with "monospace,normal,400".
    [junit]   [WARN ] Font "monospace,backslant,400" not found. Substituting with "monospace,normal,400".
    [junit]   [WARN ] Font "monospace,backslant,400" not found. Substituting with "monospace,normal,400".
    [junit] Test: table_overconstrained_ipd.xml
    [junit]   [WARN ] table-layout="fixed" and column-width unspecified => falling back to proportional-column-width(1) (No context info available)
    [junit]   [WARN ] table-layout="fixed" and column-width unspecified => falling back to proportional-column-width(1) (No context info available)
    [junit]   [WARN ] table-layout="fixed" and column-width unspecified => falling back to proportional-column-width(1) (No context info available)
    [junit]   [WARN ] The contents of fo:block line 3 exceed the available area in the inline-progression direction by more than 50 points. (No context info available)
    [junit]   [WARN ] The contents of fo:block line 2 exceed the available area in the inline-progression direction by more than 50 points. (No context info available)
    [junit]   [WARN ] The contents of fo:block line 1 exceed the available area in the inline-progression direction by 26688 millipoints. (No context info available)
    [junit] Test: list-block_writing-mode_rl.xml
    [junit]   [WARN ] The contents of fo:block line 1 exceed the available area in the inline-progression direction by 17344 millipoints. (No context info available)
    [junit]   [WARN ] The contents of fo:block line 1 exceed the available area in the inline-progression direction by 7344 millipoints. (No context info available)
    [junit] Test: region_display-align_table.xml
    [junit]   [WARN ] table-layout="fixed" and column-width unspecified => falling back to proportional-column-width(1) (No context info available)
    [junit]   [WARN ] table-layout="fixed" and column-width unspecified => falling back to proportional-column-width(1) (No context info available)
    [junit]   [WARN ] table-layout="fixed" and column-width unspecified => falling back to proportional-column-width(1) (No context info available)
    [junit]   [WARN ] table-layout="fixed" and column-width unspecified => falling back to proportional-column-width(1) (No context info available)
    [junit]   [WARN ] table-layout="fixed" and column-width unspecified => falling back to proportional-column-width(1) (No context info available)
    [junit]   [WARN ] table-layout="fixed" and column-width unspecified => falling back to proportional-column-width(1) (No context info available)
    [junit]   [WARN ] table-layout="fixed" and column-width unspecified => falling back to proportional-column-width(1) (No context info available)
    [junit]   [WARN ] table-layout="fixed" and column-width unspecified => falling back to proportional-column-width(1) (No context info available)
    [junit]   [WARN ] table-layout="fixed" and column-width unspecified => falling back to proportional-column-width(1) (No context info available)
    [junit]   [WARN ] table-layout="fixed" and column-width unspecified => falling back to proportional-column-width(1) (No context info available)
    [junit]   [WARN ] table-layout="fixed" and column-width unspecified => falling back to proportional-column-width(1) (No context info available)
    [junit]   [WARN ] table-layout="fixed" and column-width unspecified => falling back to proportional-column-width(1) (No context info available)
    [junit]   [WARN ] table-layout="fixed" and column-width unspecified => falling back to proportional-column-width(1) (No context info available)
    [junit]   [WARN ] table-layout="fixed" and column-width unspecified => falling back to proportional-column-width(1) (No context info available)
    [junit]   [WARN ] table-layout="fixed" and column-width unspecified => falling back to proportional-column-width(1) (No context info available)
    [junit] Test: simple-page-master_borders_padding.xml
    [junit]   [WARN ] Border and padding for fo:region-body "xsl-region-body" should be '0' (See 6.4.14 in XSL 1.1); non-standard values are allowed if relaxed validation is enabled.  (No context info available)
    [junit]   [WARN ] Border and padding for fo:region-before "xsl-region-before" should be '0' (See 6.4.14 in XSL 1.1); non-standard values are allowed if relaxed validation is enabled.  (No context info available)
    [junit]   [WARN ] Border and padding for fo:region-after "xsl-region-after" should be '0' (See 6.4.14 in XSL 1.1); non-standard values are allowed if relaxed validation is enabled.  (No context info available)
    [junit]   [WARN ] Border and padding for fo:region-start "xsl-region-start" should be '0' (See 6.4.14 in XSL 1.1); non-standard values are allowed if relaxed validation is enabled.  (No context info available)
    [junit] Test: table_padding_percentages.xml
    [junit]   [WARN ] table-layout="fixed" and column-width unspecified => falling back to proportional-column-width(1) (No context info available)
    [junit]   [WARN ] table-layout="fixed" and column-width unspecified => falling back to proportional-column-width(1) (No context info available)
    [junit]   [WARN ] table-layout="fixed" and column-width unspecified => falling back to proportional-column-width(1) (No context info available)
    [junit] Test: markers_10.xml
    [junit]   [WARN ] table-layout="fixed" and column-width unspecified => falling back to proportional-column-width(1) (No context info available)
    [junit] Test: bookmarks_2.xml
    [junit]   [WARN ] Font "Symbol,normal,700" not found. Substituting with "Symbol,normal,400".
    [junit]   [WARN ] Font "ZapfDingbats,normal,700" not found. Substituting with "ZapfDingbats,normal,400".
    [junit]   [WARN ] Font "Symbol,normal,700" not found. Substituting with "Symbol,normal,400".
    [junit]   [WARN ] Font "ZapfDingbats,normal,700" not found. Substituting with "ZapfDingbats,normal,400".
    [junit]   [WARN ] Font "Symbol,normal,700" not found. Substituting with "Symbol,normal,400".
    [junit]   [WARN ] Font "ZapfDingbats,normal,700" not found. Substituting with "ZapfDingbats,normal,400".
    [junit]   [WARN ] Font "Symbol,normal,700" not found. Substituting with "Symbol,normal,400".
    [junit]   [WARN ] Font "ZapfDingbats,normal,700" not found. Substituting with "ZapfDingbats,normal,400".
    [junit]   [WARN ] Font "Symbol,normal,700" not found. Substituting with "Symbol,normal,400".
    [junit]   [WARN ] Font "ZapfDingbats,normal,700" not found. Substituting with "ZapfDingbats,normal,400".
    [junit]   [WARN ] Font "Symbol,normal,700" not found. Substituting with "Symbol,normal,400".
    [junit]   [WARN ] Font "ZapfDingbats,normal,700" not found. Substituting with "ZapfDingbats,normal,400".
    [junit]   [WARN ] Font "Symbol,normal,700" not found. Substituting with "Symbol,normal,400".
    [junit]   [WARN ] Font "ZapfDingbats,normal,700" not found. Substituting with "ZapfDingbats,normal,400".
    [junit]   [WARN ] Font "Symbol,normal,700" not found. Substituting with "Symbol,normal,400".
    [junit]   [WARN ] Font "ZapfDingbats,normal,700" not found. Substituting with "ZapfDingbats,normal,400".
    [junit]   [WARN ] Font "Symbol,normal,700" not found. Substituting with "Symbol,normal,400".
    [junit]   [WARN ] Font "ZapfDingbats,normal,700" not found. Substituting with "ZapfDingbats,normal,400".
    [junit]   [WARN ] Font "Symbol,normal,700" not found. Substituting with "Symbol,normal,400".
    [junit]   [WARN ] Font "ZapfDingbats,normal,700" not found. Substituting with "ZapfDingbats,normal,400".
    [junit]   [WARN ] Font "Symbol,normal,700" not found. Substituting with "Symbol,normal,400".
    [junit]   [WARN ] Font "ZapfDingbats,normal,700" not found. Substituting with "ZapfDingbats,normal,400".
    [junit]   [WARN ] Font "Symbol,normal,700" not found. Substituting with "Symbol,normal,400".
    [junit]   [WARN ] Font "ZapfDingbats,normal,700" not found. Substituting with "ZapfDingbats,normal,400".
    [junit]   [WARN ] Font "Symbol,normal,700" not found. Substituting with "Symbol,normal,400".
    [junit]   [WARN ] Font "ZapfDingbats,normal,700" not found. Substituting with "ZapfDingbats,normal,400".
    [junit]   [WARN ] Font "Symbol,normal,700" not found. Substituting with "Symbol,normal,400".
    [junit]   [WARN ] Font "ZapfDingbats,normal,700" not found. Substituting with "ZapfDingbats,normal,400".
    [junit]   [WARN ] Font "Symbol,normal,700" not found. Substituting with "Symbol,normal,400".
    [junit]   [WARN ] Font "ZapfDingbats,normal,700" not found. Substituting with "ZapfDingbats,normal,400".
    [junit]   [WARN ] Font "Symbol,normal,700" not found. Substituting with "Symbol,normal,400".
    [junit]   [WARN ] Font "ZapfDingbats,normal,700" not found. Substituting with "ZapfDingbats,normal,400".
    [junit]   [WARN ] Font "Symbol,normal,700" not found. Substituting with "Symbol,normal,400".
    [junit]   [WARN ] Font "ZapfDingbats,normal,700" not found. Substituting with "ZapfDingbats,normal,400".
    [junit]   [WARN ] Font "Symbol,normal,700" not found. Substituting with "Symbol,normal,400".
    [junit]   [WARN ] Font "ZapfDingbats,normal,700" not found. Substituting with "ZapfDingbats,normal,400".
    [junit]   [WARN ] Font "Symbol,normal,700" not found. Substituting with "Symbol,normal,400".
    [junit]   [WARN ] Font "ZapfDingbats,normal,700" not found. Substituting with "ZapfDingbats,normal,400".
    [junit]   [WARN ] Font "Symbol,normal,700" not found. Substituting with "Symbol,normal,400".
    [junit]   [WARN ] Font "ZapfDingbats,normal,700" not found. Substituting with "ZapfDingbats,normal,400".
    [junit] Test: page-number-citation_writing-mode_rl_bug2789.xml
    [junit]   [WARN ] Font "Arial,normal,400" not found. Substituting with "any,normal,400".
    [junit]   [WARN ] Font "Arial,normal,400" not found. Substituting with "any,normal,400".
    [junit]   [WARN ] Font "Arial,normal,400" not found. Substituting with "any,normal,400".
    [junit]   [WARN ] Font "Arial,normal,400" not found. Substituting with "any,normal,400".
    [junit]   [WARN ] Font "Arial,normal,400" not found. Substituting with "any,normal,400".
    [junit]   [WARN ] Font "Arial,normal,400" not found. Substituting with "any,normal,400".
    [junit]   [WARN ] Font "Arial,normal,400" not found. Substituting with "any,normal,400".
    [junit]   [WARN ] Font "Arial,normal,400" not found. Substituting with "any,normal,400".
    [junit]   [WARN ] Font "Arial,normal,400" not found. Substituting with "any,normal,400".
    [junit]   [WARN ] Font "Arial,normal,400" not found. Substituting with "any,normal,400".
    [junit]   [WARN ] Font "Arial,normal,400" not found. Substituting with "any,normal,400".
    [junit]   [WARN ] Font "Arial,normal,400" not found. Substituting with "any,normal,400".
    [junit]   [WARN ] Font "Arial,normal,400" not found. Substituting with "any,normal,400".
    [junit]   [WARN ] Font "Arial,normal,400" not found. Substituting with "any,normal,400".
    [junit]   [WARN ] Font "Arial,normal,400" not found. Substituting with "any,normal,400".
    [junit]   [WARN ] Font "Arial,normal,400" not found. Substituting with "any,normal,400".
    [junit]   [WARN ] Font "Arial,normal,400" not found. Substituting with "any,normal,400".
    [junit]   [WARN ] Font "Arial,normal,400" not found. Substituting with "any,normal,400".
    [junit]   [WARN ] Font "Arial,normal,400" not found. Substituting with "any,normal,400".
    [junit]   [WARN ] Font "Arial,normal,400" not found. Substituting with "any,normal,400".
    [junit]   [WARN ] Font "Arial,normal,400" not found. Substituting with "any,normal,400".
    [junit]   [WARN ] Font "Arial,normal,400" not found. Substituting with "any,normal,400".
    [junit]   [WARN ] Font "Arial,normal,400" not found. Substituting with "any,normal,400".
    [junit]   [WARN ] Font "Arial,normal,400" not found. Substituting with "any,normal,400".
    [junit]   [WARN ] Font "Arial,normal,400" not found. Substituting with "any,normal,400".
    [junit]   [WARN ] Font "Arial,normal,400" not found. Substituting with "any,normal,400".
    [junit]   [WARN ] Font "Arial,normal,400" not found. Substituting with "any,normal,400".
    [junit]   [WARN ] Font "Arial,normal,400" not found. Substituting with "any,normal,400".
    [junit]   [WARN ] Font "Arial,normal,400" not found. Substituting with "any,normal,400".
    [junit]   [WARN ] Font "Arial,normal,400" not found. Substituting with "any,normal,400".
    [junit]   [WARN ] Font "Arial,normal,400" not found. Substituting with "any,normal,400".
    [junit]   [WARN ] Font "Arial,normal,400" not found. Substituting with "any,normal,400".
    [junit]   [WARN ] Font "Arial,normal,400" not found. Substituting with "any,normal,400".
    [junit]   [WARN ] Font "Arial,normal,400" not found. Substituting with "any,normal,400".
    [junit]   [WARN ] Font "Arial,normal,400" not found. Substituting with "any,normal,400".
    [junit]   [WARN ] Font "Arial,normal,400" not found. Substituting with "any,normal,400".
    [junit]   [WARN ] Font "Arial,normal,400" not found. Substituting with "any,normal,400".
    [junit]   [WARN ] Font "Arial,normal,400" not found. Substituting with "any,normal,400".
    [junit]   [WARN ] Font "Arial,normal,400" not found. Substituting with "any,normal,400".
    [junit]   [WARN ] Font "Arial,normal,400" not found. Substituting with "any,normal,400".
    [junit]   [WARN ] Font "Arial,normal,400" not found. Substituting with "any,normal,400".
    [junit]   [WARN ] Font "Arial,normal,400" not found. Substituting with "any,normal,400".
    [junit]   [WARN ] Font "Arial,normal,400" not found. Substituting with "any,normal,400".
    [junit]   [WARN ] Font "Arial,normal,400" not found. Substituting with "any,normal,400".
    [junit]   [WARN ] Font "Arial,normal,400" not found. Substituting with "any,normal,400".
    [junit]   [WARN ] Font "Arial,normal,400" not found. Substituting with "any,normal,400".
    [junit]   [WARN ] Font "Arial,normal,400" not found. Substituting with "any,normal,400".
    [junit]   [WARN ] Font "Arial,normal,400" not found. Substituting with "any,normal,400".
    [junit]   [WARN ] Font "Arial,normal,400" not found. Substituting with "any,normal,400".
    [junit]   [WARN ] Font "Arial,normal,400" not found. Substituting with "any,normal,400".
    [junit]   [WARN ] Font "Arial,normal,400" not found. Substituting with "any,normal,400".
    [junit]   [WARN ] Font "Arial,normal,400" not found. Substituting with "any,normal,400".
    [junit]   [WARN ] Font "Arial,normal,400" not found. Substituting with "any,normal,400".
    [junit]   [WARN ] Font "Arial,normal,400" not found. Substituting with "any,normal,400".
    [junit]   [WARN ] Font "Arial,normal,400" not found. Substituting with "any,normal,400".
    [junit]   [WARN ] Font "Arial,normal,400" not found. Substituting with "any,normal,400".
    [junit]   [WARN ] Glyph "?" (0x627, afii57415) not available in font "Times-Roman".
    [junit]   [WARN ] Glyph "?" (0x644, afii57444) not available in font "Times-Roman".
    [junit]   [WARN ] Glyph "?" (0x628, afii57416) not available in font "Times-Roman".
    [junit]   [WARN ] Glyph "?" (0x64a, afii57450) not available in font "Times-Roman".
    [junit]   [WARN ] Glyph "?" (0x646, afii57446) not available in font "Times-Roman".
    [junit]   [WARN ] Glyph "?" (0x62a, afii57418) not available in font "Times-Roman".
    [junit]   [WARN ] Font "Arial,normal,400" not found. Substituting with "any,normal,400".
    [junit]   [WARN ] Font "Arial,normal,400" not found. Substituting with "any,normal,400".
    [junit]   [WARN ] Font "Arial,normal,400" not found. Substituting with "any,normal,400".
    [junit] Test: table_border_padding_3.xml
    [junit]   [WARN ] page-position="last" master reference missing. (No context info available)
    [junit] ------------- ---------------- ---------------
    [junit] Testsuite: org.apache.fop.layoutmgr.BreakElementTestCase
    [junit] Tests run: 1, Failures: 0, Errors: 0, Skipped: 0, Time elapsed: 0.002 sec
    [junit]
    [junit] Testsuite: org.apache.fop.layoutmgr.PageSequenceLayoutManagerTestCase
    [junit] Tests run: 3, Failures: 0, Errors: 0, Skipped: 0, Time elapsed: 0.087 sec
    [junit]
    [junit] Testsuite: org.apache.fop.layoutmgr.RetrieveTableMarkerLayoutManagerMakerTestCase
    [junit] Tests run: 1, Failures: 0, Errors: 0, Skipped: 0, Time elapsed: 0.007 sec
    [junit]
    [junit] Testsuite: org.apache.fop.layoutmgr.RetrieveTableMarkerLayoutManagerTestCase
    [junit] Tests run: 1, Failures: 0, Errors: 0, Skipped: 0, Time elapsed: 0.116 sec
    [junit]
    [junit] Testsuite: org.apache.fop.layoutmgr.table.TableCellLayoutManagerTestCase
    [junit] Tests run: 1, Failures: 0, Errors: 0, Skipped: 0, Time elapsed: 0.116 sec
    [junit]
    [junit] Testsuite: org.apache.fop.layoutmgr.table.TableContentLayoutManagerTestCase
    [junit] Tests run: 1, Failures: 0, Errors: 0, Skipped: 0, Time elapsed: 0.011 sec
    [junit]
    [junit] Testsuite: org.apache.fop.layoutmgr.table.TableLayoutManagerTestCase
    [junit] Tests run: 2, Failures: 0, Errors: 0, Skipped: 0, Time elapsed: 0.031 sec
    [junit]
    [junit] Testsuite: org.apache.fop.pdf.AbstractPDFStreamTestCase
    [junit] Tests run: 10, Failures: 0, Errors: 0, Skipped: 0, Time elapsed: 0.004 sec
    [junit]
    [junit] Testsuite: org.apache.fop.pdf.FileIDGeneratorTestCase
    [junit] Tests run: 8, Failures: 0, Errors: 0, Skipped: 0, Time elapsed: 0.004 sec
    [junit]
    [junit] Testsuite: org.apache.fop.pdf.ObjectStreamManagerTestCase
    [junit] Tests run: 1, Failures: 0, Errors: 0, Skipped: 0, Time elapsed: 0.003 sec
    [junit]
    [junit] Testsuite: org.apache.fop.pdf.ObjectStreamTestCase
    [junit] Tests run: 4, Failures: 0, Errors: 0, Skipped: 0, Time elapsed: 0.002 sec
    [junit]
    [junit] Testsuite: org.apache.fop.pdf.PDFAModeTestCase
    [junit] Tests run: 6, Failures: 0, Errors: 0, Skipped: 0, Time elapsed: 0.013 sec
    [junit]
    [junit] Testsuite: org.apache.fop.pdf.PDFArrayTestCase
    [junit] Tests run: 15, Failures: 0, Errors: 0, Skipped: 0, Time elapsed: 0.006 sec
    [junit]
    [junit] Testsuite: org.apache.fop.pdf.PDFAttachmentTestCase
    [junit] Tests run: 3, Failures: 0, Errors: 0, Skipped: 0, Time elapsed: 0.046 sec
    [junit]
    [junit] Testsuite: org.apache.fop.pdf.PDFDestsTestCase
    [junit] Tests run: 10, Failures: 0, Errors: 0, Skipped: 0, Time elapsed: 0.004 sec
    [junit]
    [junit] Testsuite: org.apache.fop.pdf.PDFDictionaryTestCase
    [junit] Tests run: 13, Failures: 0, Errors: 0, Skipped: 0, Time elapsed: 0.005 sec
    [junit]
    [junit] Testsuite: org.apache.fop.pdf.PDFDocumentGraphics2DTestCase
    [junit] Tests run: 1, Failures: 0, Errors: 0, Skipped: 0, Time elapsed: 0.003 sec
    [junit]
    [junit] Testsuite: org.apache.fop.pdf.PDFDocumentTestCase
    [junit] Tests run: 1, Failures: 0, Errors: 0, Skipped: 0, Time elapsed: 0.001 sec
    [junit]
    [junit] Testsuite: org.apache.fop.pdf.PDFEncodingTestCase
    [junit] Tests run: 4, Failures: 0, Errors: 0, Skipped: 0, Time elapsed: 0.002 sec
    [junit]
    [junit] Testsuite: org.apache.fop.pdf.PDFEncryptionJCETestCase
    [junit] Tests run: 11, Failures: 0, Errors: 1, Skipped: 0, Time elapsed: 0.539 sec
    [junit]
    [junit] Testcase: testAES256(org.apache.fop.pdf.PDFEncryptionJCETestCase): Caused an ERROR
    [junit] java.security.InvalidKeyException: Illegal key size
    [junit] java.lang.IllegalStateException: java.security.InvalidKeyException: Illegal key size
    [junit] at org.apache.fop.pdf.PDFEncryptionJCE.initCipher(PDFEncryptionJCE.java:792)
    [junit] at org.apache.fop.pdf.PDFEncryptionJCE.encryptWithKey(PDFEncryptionJCE.java:759)
    [junit] at org.apache.fop.pdf.PDFEncryptionJCE.access$800(PDFEncryptionJCE.java:43)
    [junit] at org.apache.fop.pdf.PDFEncryptionJCE$Rev5Engine.computeUEValue(PDFEncryptionJCE.java:578)
    [junit] at org.apache.fop.pdf.PDFEncryptionJCE$Rev5Engine.run(PDFEncryptionJCE.java:476)
    [junit] at org.apache.fop.pdf.PDFEncryptionJCE$EncryptionInitializer.init(PDFEncryptionJCE.java:84)
    [junit] at org.apache.fop.pdf.PDFEncryptionJCE.<init>(PDFEncryptionJCE.java:682)
    [junit] at org.apache.fop.pdf.PDFEncryptionJCE.make(PDFEncryptionJCE.java:696)
    [junit] at org.apache.fop.pdf.PDFEncryptionJCETestCase.createEncryptionObject(PDFEncryptionJCETestCase.java:611)
    [junit] at org.apache.fop.pdf.PDFEncryptionJCETestCase.testAES256(PDFEncryptionJCETestCase.java:468)
    [junit] Caused by: java.security.InvalidKeyException: Illegal key size
    [junit] at javax.crypto.Cipher.checkCryptoPerm(Cipher.java:1029)
    [junit] at javax.crypto.Cipher.implInit(Cipher.java:795)
    [junit] at javax.crypto.Cipher.chooseProvider(Cipher.java:854)
    [junit] at javax.crypto.Cipher.init(Cipher.java:1374)
    [junit] at javax.crypto.Cipher.init(Cipher.java:1308)
    [junit] at org.apache.fop.pdf.PDFEncryptionJCE.initCipher(PDFEncryptionJCE.java:789)
    [junit]
    [junit]

BUILD FAILED
<https://builds.apache.org/job/xmlgraphics-fop-ant/ws/fop/build.xml>:770: Tests failed

Total time: 2 minutes 45 seconds
Build step 'Execute shell' marked build as failure
Reply | Threaded
Open this post in threaded view
|

Build failed in Jenkins: xmlgraphics-fop-ant #440

Apache Jenkins Server
See <https://builds.apache.org/job/xmlgraphics-fop-ant/440/display/redirect>

Changes:


------------------------------------------
[...truncated 346.01 KB...]
    [junit]   [WARN ] Font "Symbol,normal,700" not found. Substituting with "Symbol,normal,400".
    [junit]   [WARN ] Font "ZapfDingbats,normal,700" not found. Substituting with "ZapfDingbats,normal,400".
    [junit]   [WARN ] Font "Symbol,normal,700" not found. Substituting with "Symbol,normal,400".
    [junit]   [WARN ] Font "ZapfDingbats,normal,700" not found. Substituting with "ZapfDingbats,normal,400".
    [junit]   [WARN ] Font "Symbol,normal,700" not found. Substituting with "Symbol,normal,400".
    [junit]   [WARN ] Font "ZapfDingbats,normal,700" not found. Substituting with "ZapfDingbats,normal,400".
    [junit]   [WARN ] Font "Symbol,normal,700" not found. Substituting with "Symbol,normal,400".
    [junit]   [WARN ] Font "ZapfDingbats,normal,700" not found. Substituting with "ZapfDingbats,normal,400".
    [junit] Test: block_font-autoselect.xml
    [junit]   [WARN ] Glyph "?" (0x2211, summation) not available in font "Helvetica".
    [junit]   [WARN ] Glyph "s" (0x73, s) not available in font "Symbol".
    [junit]   [WARN ] Glyph "y" (0x79, y) not available in font "Symbol".
    [junit]   [WARN ] Glyph "m" (0x6d, m) not available in font "Symbol".
    [junit] Test: simple-page-master_borders_padding.xml
    [junit]   [WARN ] Border and padding for fo:region-body "xsl-region-body" should be '0' (See 6.4.14 in XSL 1.1); non-standard values are allowed if relaxed validation is enabled.  (No context info available)
    [junit]   [WARN ] Border and padding for fo:region-before "xsl-region-before" should be '0' (See 6.4.14 in XSL 1.1); non-standard values are allowed if relaxed validation is enabled.  (No context info available)
    [junit]   [WARN ] Border and padding for fo:region-after "xsl-region-after" should be '0' (See 6.4.14 in XSL 1.1); non-standard values are allowed if relaxed validation is enabled.  (No context info available)
    [junit]   [WARN ] Border and padding for fo:region-start "xsl-region-start" should be '0' (See 6.4.14 in XSL 1.1); non-standard values are allowed if relaxed validation is enabled.  (No context info available)
    [junit] Test: table-footer_omit-footer-at-break.xml
    [junit]   [WARN ] table-layout="fixed" and column-width unspecified => falling back to proportional-column-width(1) (No context info available)
    [junit] Test: block_linefeed-treatment_2.xml
    [junit]   [WARN ] Font "Symbol,normal,700" not found. Substituting with "Symbol,normal,400".
    [junit]   [WARN ] Font "ZapfDingbats,normal,700" not found. Substituting with "ZapfDingbats,normal,400".
    [junit]   [WARN ] Font "Symbol,normal,700" not found. Substituting with "Symbol,normal,400".
    [junit]   [WARN ] Font "ZapfDingbats,normal,700" not found. Substituting with "ZapfDingbats,normal,400".
    [junit]   [WARN ] Font "Symbol,normal,700" not found. Substituting with "Symbol,normal,400".
    [junit]   [WARN ] Font "ZapfDingbats,normal,700" not found. Substituting with "ZapfDingbats,normal,400".
    [junit]   [WARN ] Font "Symbol,normal,700" not found. Substituting with "Symbol,normal,400".
    [junit]   [WARN ] Font "ZapfDingbats,normal,700" not found. Substituting with "ZapfDingbats,normal,400".
    [junit]   [WARN ] Font "Symbol,normal,700" not found. Substituting with "Symbol,normal,400".
    [junit]   [WARN ] Font "ZapfDingbats,normal,700" not found. Substituting with "ZapfDingbats,normal,400".
    [junit]   [WARN ] Font "Symbol,normal,700" not found. Substituting with "Symbol,normal,400".
    [junit]   [WARN ] Font "ZapfDingbats,normal,700" not found. Substituting with "ZapfDingbats,normal,400".
    [junit]   [WARN ] Font "Symbol,normal,700" not found. Substituting with "Symbol,normal,400".
    [junit]   [WARN ] Font "ZapfDingbats,normal,700" not found. Substituting with "ZapfDingbats,normal,400".
    [junit]   [WARN ] Font "Symbol,normal,700" not found. Substituting with "Symbol,normal,400".
    [junit]   [WARN ] Font "ZapfDingbats,normal,700" not found. Substituting with "ZapfDingbats,normal,400".
    [junit]   [WARN ] Font "Symbol,normal,700" not found. Substituting with "Symbol,normal,400".
    [junit]   [WARN ] Font "ZapfDingbats,normal,700" not found. Substituting with "ZapfDingbats,normal,400".
    [junit]   [WARN ] Font "Symbol,normal,700" not found. Substituting with "Symbol,normal,400".
    [junit]   [WARN ] Font "ZapfDingbats,normal,700" not found. Substituting with "ZapfDingbats,normal,400".
    [junit]   [WARN ] Font "Symbol,normal,700" not found. Substituting with "Symbol,normal,400".
    [junit]   [WARN ] Font "ZapfDingbats,normal,700" not found. Substituting with "ZapfDingbats,normal,400".
    [junit]   [WARN ] Font "Symbol,normal,700" not found. Substituting with "Symbol,normal,400".
    [junit]   [WARN ] Font "ZapfDingbats,normal,700" not found. Substituting with "ZapfDingbats,normal,400".
    [junit]   [WARN ] Font "Symbol,normal,700" not found. Substituting with "Symbol,normal,400".
    [junit]   [WARN ] Font "ZapfDingbats,normal,700" not found. Substituting with "ZapfDingbats,normal,400".
    [junit]   [WARN ] Font "Symbol,normal,700" not found. Substituting with "Symbol,normal,400".
    [junit]   [WARN ] Font "ZapfDingbats,normal,700" not found. Substituting with "ZapfDingbats,normal,400".
    [junit]   [WARN ] Font "Symbol,normal,700" not found. Substituting with "Symbol,normal,400".
    [junit]   [WARN ] Font "ZapfDingbats,normal,700" not found. Substituting with "ZapfDingbats,normal,400".
    [junit]   [WARN ] Font "Symbol,normal,700" not found. Substituting with "Symbol,normal,400".
    [junit]   [WARN ] Font "ZapfDingbats,normal,700" not found. Substituting with "ZapfDingbats,normal,400".
    [junit]   [WARN ] Font "Symbol,normal,700" not found. Substituting with "Symbol,normal,400".
    [junit]   [WARN ] Font "ZapfDingbats,normal,700" not found. Substituting with "ZapfDingbats,normal,400".
    [junit]   [WARN ] Font "Symbol,normal,700" not found. Substituting with "Symbol,normal,400".
    [junit]   [WARN ] Font "ZapfDingbats,normal,700" not found. Substituting with "ZapfDingbats,normal,400".
    [junit]   [WARN ] Font "Symbol,normal,700" not found. Substituting with "Symbol,normal,400".
    [junit]   [WARN ] Font "ZapfDingbats,normal,700" not found. Substituting with "ZapfDingbats,normal,400".
    [junit]   [WARN ] Font "Symbol,normal,700" not found. Substituting with "Symbol,normal,400".
    [junit]   [WARN ] Font "ZapfDingbats,normal,700" not found. Substituting with "ZapfDingbats,normal,400".
    [junit] Test: simple-page-master_regions.xml
    [junit]   [WARN ] The contents of fo:region-before on page 1 exceed the available area in the block-progression direction by 23200 millipoints. (No context info available)
    [junit]   [WARN ] The contents of fo:block line 2 exceed the available area in the inline-progression direction by 10012 millipoints. (No context info available)
    [junit]   [WARN ] The contents of fo:block line 1 exceed the available area in the inline-progression direction by 17344 millipoints. (No context info available)
    [junit]   [WARN ] The contents of fo:block line 2 exceed the available area in the inline-progression direction by 10012 millipoints. (No context info available)
    [junit]   [WARN ] The contents of fo:block line 1 exceed the available area in the inline-progression direction by 17344 millipoints. (No context info available)
    [junit]   [WARN ] The contents of fo:block line 2 exceed the available area in the inline-progression direction by 10012 millipoints. (No context info available)
    [junit]   [WARN ] The contents of fo:block line 1 exceed the available area in the inline-progression direction by 17344 millipoints. (No context info available)
    [junit]   [WARN ] The contents of fo:region-end on page 1 exceed the available area in the block-progression direction by 23200 millipoints. (No context info available)
    [junit] Test: table-column_gap.xml
    [junit]   [WARN ] table-layout="fixed" and column-width unspecified => falling back to proportional-column-width(1) (No context info available)
    [junit]   [WARN ] table-layout="fixed" and column-width unspecified => falling back to proportional-column-width(1) (No context info available)
    [junit] Test: table_border_padding_5.xml
    [junit]   [ERROR] Image not found. URI: a. (No context info available)
    [junit]   [WARN ] Font "Symbol,normal,700" not found. Substituting with "Symbol,normal,400".
    [junit]   [WARN ] Font "ZapfDingbats,normal,700" not found. Substituting with "ZapfDingbats,normal,400".
    [junit]   [WARN ] Font "Symbol,normal,700" not found. Substituting with "Symbol,normal,400".
    [junit]   [WARN ] Font "ZapfDingbats,normal,700" not found. Substituting with "ZapfDingbats,normal,400".
    [junit]   [WARN ] Font "Symbol,normal,700" not found. Substituting with "Symbol,normal,400".
    [junit]   [WARN ] Font "ZapfDingbats,normal,700" not found. Substituting with "ZapfDingbats,normal,400".
    [junit]   [WARN ] Font "Symbol,normal,700" not found. Substituting with "Symbol,normal,400".
    [junit]   [WARN ] Font "ZapfDingbats,normal,700" not found. Substituting with "ZapfDingbats,normal,400".
    [junit]   [WARN ] Font "Symbol,normal,700" not found. Substituting with "Symbol,normal,400".
    [junit]   [WARN ] Font "ZapfDingbats,normal,700" not found. Substituting with "ZapfDingbats,normal,400".
    [junit]   [WARN ] Font "Symbol,normal,700" not found. Substituting with "Symbol,normal,400".
    [junit]   [WARN ] Font "ZapfDingbats,normal,700" not found. Substituting with "ZapfDingbats,normal,400".
    [junit]   [WARN ] Font "Symbol,normal,700" not found. Substituting with "Symbol,normal,400".
    [junit]   [WARN ] Font "ZapfDingbats,normal,700" not found. Substituting with "ZapfDingbats,normal,400".
    [junit]   [WARN ] Font "Symbol,normal,700" not found. Substituting with "Symbol,normal,400".
    [junit]   [WARN ] Font "ZapfDingbats,normal,700" not found. Substituting with "ZapfDingbats,normal,400".
    [junit]   [WARN ] Font "Symbol,normal,700" not found. Substituting with "Symbol,normal,400".
    [junit]   [WARN ] Font "ZapfDingbats,normal,700" not found. Substituting with "ZapfDingbats,normal,400".
    [junit]   [WARN ] Font "Symbol,normal,700" not found. Substituting with "Symbol,normal,400".
    [junit]   [WARN ] Font "ZapfDingbats,normal,700" not found. Substituting with "ZapfDingbats,normal,400".
    [junit]   [WARN ] Font "Symbol,normal,700" not found. Substituting with "Symbol,normal,400".
    [junit]   [WARN ] Font "ZapfDingbats,normal,700" not found. Substituting with "ZapfDingbats,normal,400".
    [junit]   [WARN ] Font "Symbol,normal,700" not found. Substituting with "Symbol,normal,400".
    [junit]   [WARN ] Font "ZapfDingbats,normal,700" not found. Substituting with "ZapfDingbats,normal,400".
    [junit]   [WARN ] Font "Symbol,normal,700" not found. Substituting with "Symbol,normal,400".
    [junit]   [WARN ] Font "ZapfDingbats,normal,700" not found. Substituting with "ZapfDingbats,normal,400".
    [junit]   [WARN ] Font "Symbol,normal,700" not found. Substituting with "Symbol,normal,400".
    [junit]   [WARN ] Font "ZapfDingbats,normal,700" not found. Substituting with "ZapfDingbats,normal,400".
    [junit]   [WARN ] Font "Symbol,normal,700" not found. Substituting with "Symbol,normal,400".
    [junit]   [WARN ] Font "ZapfDingbats,normal,700" not found. Substituting with "ZapfDingbats,normal,400".
    [junit]   [WARN ] Font "Symbol,normal,700" not found. Substituting with "Symbol,normal,400".
    [junit]   [WARN ] Font "ZapfDingbats,normal,700" not found. Substituting with "ZapfDingbats,normal,400".
    [junit]   [WARN ] Font "Symbol,normal,700" not found. Substituting with "Symbol,normal,400".
    [junit]   [WARN ] Font "ZapfDingbats,normal,700" not found. Substituting with "ZapfDingbats,normal,400".
    [junit]   [WARN ] Font "Symbol,normal,700" not found. Substituting with "Symbol,normal,400".
    [junit]   [WARN ] Font "ZapfDingbats,normal,700" not found. Substituting with "ZapfDingbats,normal,400".
    [junit]   [WARN ] Font "Symbol,normal,700" not found. Substituting with "Symbol,normal,400".
    [junit]   [WARN ] Font "ZapfDingbats,normal,700" not found. Substituting with "ZapfDingbats,normal,400".
    [junit]   [WARN ] Font "Symbol,normal,700" not found. Substituting with "Symbol,normal,400".
    [junit]   [WARN ] Font "ZapfDingbats,normal,700" not found. Substituting with "ZapfDingbats,normal,400".
    [junit]   [WARN ] The contents of fo:region-body on page 1 exceed its viewport by 5668 millipoints. (No context info available)
    [junit]   [WARN ] Font "Symbol,normal,700" not found. Substituting with "Symbol,normal,400".
    [junit]   [WARN ] Font "ZapfDingbats,normal,700" not found. Substituting with "ZapfDingbats,normal,400".
    [junit]   [WARN ] Font "Symbol,normal,700" not found. Substituting with "Symbol,normal,400".
    [junit]   [WARN ] Font "ZapfDingbats,normal,700" not found. Substituting with "ZapfDingbats,normal,400".
    [junit]   [WARN ] Font "Symbol,normal,700" not found. Substituting with "Symbol,normal,400".
    [junit]   [WARN ] Font "ZapfDingbats,normal,700" not found. Substituting with "ZapfDingbats,normal,400".
    [junit]   [WARN ] Font "Symbol,normal,700" not found. Substituting with "Symbol,normal,400".
    [junit]   [WARN ] Font "ZapfDingbats,normal,700" not found. Substituting with "ZapfDingbats,normal,400".
    [junit]   [WARN ] Font "Symbol,normal,700" not found. Substituting with "Symbol,normal,400".
    [junit]   [WARN ] Font "ZapfDingbats,normal,700" not found. Substituting with "ZapfDingbats,normal,400".
    [junit]   [WARN ] Font "Symbol,normal,700" not found. Substituting with "Symbol,normal,400".
    [junit]   [WARN ] Font "ZapfDingbats,normal,700" not found. Substituting with "ZapfDingbats,normal,400".
    [junit]   [WARN ] Font "Symbol,normal,700" not found. Substituting with "Symbol,normal,400".
    [junit]   [WARN ] Font "ZapfDingbats,normal,700" not found. Substituting with "ZapfDingbats,normal,400".
    [junit]   [WARN ] Font "Symbol,normal,700" not found. Substituting with "Symbol,normal,400".
    [junit]   [WARN ] Font "ZapfDingbats,normal,700" not found. Substituting with "ZapfDingbats,normal,400".
    [junit]   [WARN ] Font "Symbol,normal,700" not found. Substituting with "Symbol,normal,400".
    [junit]   [WARN ] Font "ZapfDingbats,normal,700" not found. Substituting with "ZapfDingbats,normal,400".
    [junit]   [WARN ] Font "Symbol,normal,700" not found. Substituting with "Symbol,normal,400".
    [junit]   [WARN ] Font "ZapfDingbats,normal,700" not found. Substituting with "ZapfDingbats,normal,400".
    [junit]   [WARN ] Font "Symbol,normal,700" not found. Substituting with "Symbol,normal,400".
    [junit]   [WARN ] Font "ZapfDingbats,normal,700" not found. Substituting with "ZapfDingbats,normal,400".
    [junit]   [WARN ] Font "Symbol,normal,700" not found. Substituting with "Symbol,normal,400".
    [junit]   [WARN ] Font "ZapfDingbats,normal,700" not found. Substituting with "ZapfDingbats,normal,400".
    [junit]   [WARN ] Font "Symbol,normal,700" not found. Substituting with "Symbol,normal,400".
    [junit]   [WARN ] Font "ZapfDingbats,normal,700" not found. Substituting with "ZapfDingbats,normal,400".
    [junit]   [WARN ] Font "Symbol,normal,700" not found. Substituting with "Symbol,normal,400".
    [junit]   [WARN ] Font "ZapfDingbats,normal,700" not found. Substituting with "ZapfDingbats,normal,400".
    [junit]   [WARN ] Font "Symbol,normal,700" not found. Substituting with "Symbol,normal,400".
    [junit]   [WARN ] Font "ZapfDingbats,normal,700" not found. Substituting with "ZapfDingbats,normal,400".
    [junit]   [WARN ] Font "Symbol,normal,700" not found. Substituting with "Symbol,normal,400".
    [junit]   [WARN ] Font "ZapfDingbats,normal,700" not found. Substituting with "ZapfDingbats,normal,400".
    [junit]   [WARN ] Font "Symbol,normal,700" not found. Substituting with "Symbol,normal,400".
    [junit]   [WARN ] Font "ZapfDingbats,normal,700" not found. Substituting with "ZapfDingbats,normal,400".
    [junit]   [WARN ] Font "Symbol,normal,700" not found. Substituting with "Symbol,normal,400".
    [junit]   [WARN ] Font "ZapfDingbats,normal,700" not found. Substituting with "ZapfDingbats,normal,400".
    [junit]   [WARN ] Font "Symbol,normal,700" not found. Substituting with "Symbol,normal,400".
    [junit]   [WARN ] Font "ZapfDingbats,normal,700" not found. Substituting with "ZapfDingbats,normal,400".
    [junit]   [WARN ] Font "Symbol,normal,700" not found. Substituting with "Symbol,normal,400".
    [junit]   [WARN ] Font "ZapfDingbats,normal,700" not found. Substituting with "ZapfDingbats,normal,400".
    [junit] Test: table-header_table-footer_3.xml
    [junit]   [WARN ] table-layout="fixed" and column-width unspecified => falling back to proportional-column-width(1) (No context info available)
    [junit] Test: change-bar_table.xml
    [junit]   [WARN ] The following feature isn't implemented by Apache FOP, yet: table-layout="auto" (on fo:table) (No context info available)
    [junit] ------------- ---------------- ---------------
    [junit] Testsuite: org.apache.fop.layoutmgr.BreakElementTestCase
    [junit] Tests run: 1, Failures: 0, Errors: 0, Skipped: 0, Time elapsed: 0.001 sec
    [junit]
    [junit] Testsuite: org.apache.fop.layoutmgr.PageSequenceLayoutManagerTestCase
    [junit] Tests run: 3, Failures: 0, Errors: 0, Skipped: 0, Time elapsed: 0.098 sec
    [junit]
    [junit] Testsuite: org.apache.fop.layoutmgr.RetrieveTableMarkerLayoutManagerMakerTestCase
    [junit] Tests run: 1, Failures: 0, Errors: 0, Skipped: 0, Time elapsed: 0.006 sec
    [junit]
    [junit] Testsuite: org.apache.fop.layoutmgr.RetrieveTableMarkerLayoutManagerTestCase
    [junit] Tests run: 1, Failures: 0, Errors: 0, Skipped: 0, Time elapsed: 0.08 sec
    [junit]
    [junit] Testsuite: org.apache.fop.layoutmgr.table.TableCellLayoutManagerTestCase
    [junit] Tests run: 1, Failures: 0, Errors: 0, Skipped: 0, Time elapsed: 0.125 sec
    [junit]
    [junit] Testsuite: org.apache.fop.layoutmgr.table.TableContentLayoutManagerTestCase
    [junit] Tests run: 1, Failures: 0, Errors: 0, Skipped: 0, Time elapsed: 0.011 sec
    [junit]
    [junit] Testsuite: org.apache.fop.layoutmgr.table.TableLayoutManagerTestCase
    [junit] Tests run: 2, Failures: 0, Errors: 0, Skipped: 0, Time elapsed: 0.038 sec
    [junit]
    [junit] Testsuite: org.apache.fop.pdf.AbstractPDFStreamTestCase
    [junit] Tests run: 10, Failures: 0, Errors: 0, Skipped: 0, Time elapsed: 0.004 sec
    [junit]
    [junit] Testsuite: org.apache.fop.pdf.FileIDGeneratorTestCase
    [junit] Tests run: 8, Failures: 0, Errors: 0, Skipped: 0, Time elapsed: 0.004 sec
    [junit]
    [junit] Testsuite: org.apache.fop.pdf.ObjectStreamManagerTestCase
    [junit] Tests run: 1, Failures: 0, Errors: 0, Skipped: 0, Time elapsed: 0.004 sec
    [junit]
    [junit] Testsuite: org.apache.fop.pdf.ObjectStreamTestCase
    [junit] Tests run: 4, Failures: 0, Errors: 0, Skipped: 0, Time elapsed: 0.004 sec
    [junit]
    [junit] Testsuite: org.apache.fop.pdf.PDFAModeTestCase
    [junit] Tests run: 6, Failures: 0, Errors: 0, Skipped: 0, Time elapsed: 0.003 sec
    [junit]
    [junit] Testsuite: org.apache.fop.pdf.PDFArrayTestCase
    [junit] Tests run: 15, Failures: 0, Errors: 0, Skipped: 0, Time elapsed: 0.015 sec
    [junit]
    [junit] Testsuite: org.apache.fop.pdf.PDFAttachmentTestCase
    [junit] Tests run: 3, Failures: 0, Errors: 0, Skipped: 0, Time elapsed: 0.057 sec
    [junit]
    [junit] Testsuite: org.apache.fop.pdf.PDFDestsTestCase
    [junit] Tests run: 10, Failures: 0, Errors: 0, Skipped: 0, Time elapsed: 0.004 sec
    [junit]
    [junit] Testsuite: org.apache.fop.pdf.PDFDictionaryTestCase
    [junit] Tests run: 13, Failures: 0, Errors: 0, Skipped: 0, Time elapsed: 0.006 sec
    [junit]
    [junit] Testsuite: org.apache.fop.pdf.PDFDocumentGraphics2DTestCase
    [junit] Tests run: 1, Failures: 0, Errors: 0, Skipped: 0, Time elapsed: 0.003 sec
    [junit]
    [junit] Testsuite: org.apache.fop.pdf.PDFDocumentTestCase
    [junit] Tests run: 1, Failures: 0, Errors: 0, Skipped: 0, Time elapsed: 0.001 sec
    [junit]
    [junit] Testsuite: org.apache.fop.pdf.PDFEncodingTestCase
    [junit] Tests run: 4, Failures: 0, Errors: 0, Skipped: 0, Time elapsed: 0.003 sec
    [junit]
    [junit] Testsuite: org.apache.fop.pdf.PDFEncryptionJCETestCase
    [junit] Tests run: 11, Failures: 0, Errors: 1, Skipped: 0, Time elapsed: 0.888 sec
    [junit]
    [junit] Testcase: testAES256(org.apache.fop.pdf.PDFEncryptionJCETestCase): Caused an ERROR
    [junit] java.security.InvalidKeyException: Illegal key size
    [junit] java.lang.IllegalStateException: java.security.InvalidKeyException: Illegal key size
    [junit] at org.apache.fop.pdf.PDFEncryptionJCE.initCipher(PDFEncryptionJCE.java:792)
    [junit] at org.apache.fop.pdf.PDFEncryptionJCE.encryptWithKey(PDFEncryptionJCE.java:759)
    [junit] at org.apache.fop.pdf.PDFEncryptionJCE.access$800(PDFEncryptionJCE.java:43)
    [junit] at org.apache.fop.pdf.PDFEncryptionJCE$Rev5Engine.computeUEValue(PDFEncryptionJCE.java:578)
    [junit] at org.apache.fop.pdf.PDFEncryptionJCE$Rev5Engine.run(PDFEncryptionJCE.java:476)
    [junit] at org.apache.fop.pdf.PDFEncryptionJCE$EncryptionInitializer.init(PDFEncryptionJCE.java:84)
    [junit] at org.apache.fop.pdf.PDFEncryptionJCE.<init>(PDFEncryptionJCE.java:682)
    [junit] at org.apache.fop.pdf.PDFEncryptionJCE.make(PDFEncryptionJCE.java:696)
    [junit] at org.apache.fop.pdf.PDFEncryptionJCETestCase.createEncryptionObject(PDFEncryptionJCETestCase.java:611)
    [junit] at org.apache.fop.pdf.PDFEncryptionJCETestCase.testAES256(PDFEncryptionJCETestCase.java:468)
    [junit] Caused by: java.security.InvalidKeyException: Illegal key size
    [junit] at javax.crypto.Cipher.checkCryptoPerm(Cipher.java:1029)
    [junit] at javax.crypto.Cipher.implInit(Cipher.java:795)
    [junit] at javax.crypto.Cipher.chooseProvider(Cipher.java:854)
    [junit] at javax.crypto.Cipher.init(Cipher.java:1374)
    [junit] at javax.crypto.Cipher.init(Cipher.java:1308)
    [junit] at org.apache.fop.pdf.PDFEncryptionJCE.initCipher(PDFEncryptionJCE.java:789)
    [junit]
    [junit]

BUILD FAILED
<https://builds.apache.org/job/xmlgraphics-fop-ant/ws/fop/build.xml>:770: Tests failed

Total time: 3 minutes 45 seconds
Build step 'Execute shell' marked build as failure
Reply | Threaded
Open this post in threaded view
|

Jenkins build is back to normal : xmlgraphics-fop-ant #441

Apache Jenkins Server