Build failed in Jenkins: xmlgraphics-fop #92

Previous Topic Next Topic
 
classic Classic list List threaded Threaded
4 messages Options
Reply | Threaded
Open this post in threaded view
|  
Report Content as Inappropriate

Build failed in Jenkins: xmlgraphics-fop #92

Apache Jenkins Server
See <https://builds.apache.org/job/xmlgraphics-fop/92/display/redirect?page=changes>

Changes:

[ssteiner] FOP-2693: PDF plugin document cache may return closed document

------------------------------------------
[...truncated 328.37 KB...]
AU        fop-core/src/test/java/org/apache/fop/URIResolutionTestCase.java
AU        fop-core/src/test/java/org/apache/fop/BasicTranscoderTestSuite.java
AU        fop-core/src/test/java/org/apache/fop/DigestFilterTestCase.java
AU        fop-core/src/test/java/org/apache/fop/HyphenationTestCase.java
A         fop-core/src/test/java/org/apache/fop/config
AU        fop-core/src/test/java/org/apache/fop/config/FontsDirectoryRecursiveTestCase.java
AU        fop-core/src/test/java/org/apache/fop/config/FontsSubstitutionTestCase.java
AU        fop-core/src/test/java/org/apache/fop/config/FontAttributesMissingTestCase.java
AU        fop-core/src/test/java/org/apache/fop/config/FontMetricsUrlBadTestCase.java
AU        fop-core/src/test/java/org/apache/fop/config/FontMetricsUrlMalformedTestCase.java
AU        fop-core/src/test/java/org/apache/fop/config/FontTripletAttributeMissingTestCase.java
AU        fop-core/src/test/java/org/apache/fop/config/FontsAutoDetectTestCase.java
AU        fop-core/src/test/java/org/apache/fop/config/BaseConstructiveUserConfigTest.java
AU        fop-core/src/test/java/org/apache/fop/config/UserConfigTestSuite.java
AU        fop-core/src/test/java/org/apache/fop/config/BaseUserConfigTest.java
AU        fop-core/src/test/java/org/apache/fop/config/BaseDestructiveUserConfigTest.java
A         fop-core/src/test/java/org/apache/fop/afp
A         fop-core/src/test/java/org/apache/fop/afp/AFPTestSuite.java
AU        fop-core/src/test/java/org/apache/fop/afp/AFPEventProcessingTestCase.java
A         fop-core/src/test/java/org/apache/fop/afp/modca
A         fop-core/src/test/java/org/apache/fop/afp/modca/AbstractAFPObjectTest.java
A         fop-core/src/test/java/org/apache/fop/afp/modca/AbstractTripletStructuredObjectTest.java
A         fop-core/src/test/java/org/apache/fop/afp/modca/AbstractNamedAFPObjectTest.java
A         fop-core/src/test/java/org/apache/fop/afp/modca/IncludeObjectTestCase.java
A         fop-core/src/test/java/org/apache/fop/afp/modca/AbstractStructuredObjectTest.java
A         fop-core/src/test/java/org/apache/fop/afp/AFPResourceManagerTestCase.java
A         fop-core/src/test/java/org/apache/fop/afp/ptoca
AU        fop-core/src/test/java/org/apache/fop/afp/ptoca/TransparentDataControlSequenceTestCase.java
A         fop-core/src/test/java/org/apache/fop/afp/AFPResourceUtilTestCase.java
A         fop-core/src/test/java/org/apache/fop/afp/AFPGraphics2DTestCase.java
A         fop-core/src/test/java/org/apache/fop/afp/fonts
A         fop-core/src/test/java/org/apache/fop/afp/fonts/CharactersetEncoderTestCase.java
AU        fop-core/src/test/java/org/apache/fop/afp/fonts/IntegerKeyStoreTestCase.java
A         fop-core/src/test/java/org/apache/fop/afp/goca
AU        fop-core/src/test/java/org/apache/fop/afp/goca/GraphicsCharacterStringTestCase.java
A         fop-core/src/test/java/org/apache/fop/afp/goca/GraphicsSetLineWidthTestCase.java
A         fop-core/src/test/java/org/apache/fop/afp/goca/GraphicsSetFractionalLineWidthTestCase.java
A         fop-core/src/test/java/org/apache/fop/afp/parser
A         fop-core/src/test/java/org/apache/fop/afp/parser/MODCAParserTestCase.java
A         fop-core/src/test/java/org/apache/fop/afp/AFPPaintingStateTestCase.java
A         fop-core/src/test/java/org/apache/fop/afp/util
AU        fop-core/src/test/java/org/apache/fop/afp/util/AFPResourceAccessorTestCase.java
A         fop-core/src/test/java/org/apache/fop/afp/AFPObjectAreaInfoTestCase.java
A         fop-core/src/test/java/org/apache/fop/traits
AU        fop-core/src/test/java/org/apache/fop/traits/MinOptMaxTestCase.java
AU        fop-core/src/test/java/org/apache/fop/traits/BorderPropsTestCase.java
A         fop-core/src/test/java/org/apache/fop/cli
A         fop-core/src/test/java/org/apache/fop/cli/CommandLineOptionsTestCase.java
A         fop-core/src/test/java/org/apache/fop/pdf
AU        fop-core/src/test/java/org/apache/fop/pdf/VersionControllerTestCase.java
AU        fop-core/src/test/java/org/apache/fop/pdf/TableHeaderScopeTestCase.java
AU        fop-core/src/test/java/org/apache/fop/pdf/PDFRectangleTestCase.java
AU        fop-core/src/test/java/org/apache/fop/pdf/PDFDictionaryTestCase.java
AU        fop-core/src/test/java/org/apache/fop/pdf/PDFLinearizationTestCase.java
AU        fop-core/src/test/java/org/apache/fop/pdf/FileIDGeneratorTestCase.java
AU        fop-core/src/test/java/org/apache/fop/pdf/PDFParentTreeTestCase.java
AU        fop-core/src/test/java/org/apache/fop/pdf/PDFEncryptionJCETestCase.java
AU        fop-core/src/test/java/org/apache/fop/pdf/PDFDocumentTestCase.java
AU        fop-core/src/test/java/org/apache/fop/pdf/PDFLibraryTestSuite.java
AU        fop-core/src/test/java/org/apache/fop/pdf/ObjectStreamManagerTestCase.java
AU        fop-core/src/test/java/org/apache/fop/pdf/PDFAModeTestCase.java
AU        fop-core/src/test/java/org/apache/fop/pdf/PDFVTTestCase.java
AU        fop-core/src/test/java/org/apache/fop/pdf/VersionTestCase.java
AU        fop-core/src/test/java/org/apache/fop/pdf/PDFStreamTestCase.java
A         fop-core/src/test/java/org/apache/fop/pdf/xref
AU        fop-core/src/test/java/org/apache/fop/pdf/xref/ObjectReferenceTest.java
AU        fop-core/src/test/java/org/apache/fop/pdf/xref/CompressedObjectReferenceTestCase.java
AU        fop-core/src/test/java/org/apache/fop/pdf/xref/UncompressedObjectReferenceTestCase.java
AU        fop-core/src/test/java/org/apache/fop/pdf/xref/CrossReferenceTableTestCase.java
AU        fop-core/src/test/java/org/apache/fop/pdf/xref/CrossReferenceObjectTest.java
AU        fop-core/src/test/java/org/apache/fop/pdf/xref/CrossReferenceStreamTestCase.java
AU        fop-core/src/test/java/org/apache/fop/pdf/PDFReferenceTestCase.java
AU        fop-core/src/test/java/org/apache/fop/pdf/PDFPageLabelsTestCase.java
AU        fop-core/src/test/java/org/apache/fop/pdf/PDFUATestCase.java
AU        fop-core/src/test/java/org/apache/fop/pdf/PDFObjectTestCase.java
AU        fop-core/src/test/java/org/apache/fop/pdf/PDFFactoryTestCase.java
AU        fop-core/src/test/java/org/apache/fop/pdf/PDFNullTestCase.java
AU        fop-core/src/test/java/org/apache/fop/pdf/PDFArrayTestCase.java
AU        fop-core/src/test/java/org/apache/fop/pdf/AbstractPDFStreamTestCase.java
AU        fop-core/src/test/java/org/apache/fop/pdf/PDFNameTestCase.java
AU        fop-core/src/test/java/org/apache/fop/pdf/PDFNumsArrayTestCase.java
AU        fop-core/src/test/java/org/apache/fop/pdf/PDFFilterListTestCase.java
AU        fop-core/src/test/java/org/apache/fop/pdf/PDFPagePieceTestCase.java
AU        fop-core/src/test/java/org/apache/fop/pdf/PDFDestsTestCase.java
AU        fop-core/src/test/java/org/apache/fop/pdf/PDFDocumentGraphics2DTestCase.java
AU        fop-core/src/test/java/org/apache/fop/pdf/PDFEncodingTestCase.java
AU        fop-core/src/test/java/org/apache/fop/pdf/PDFNumberTestCase.java
AU        fop-core/src/test/java/org/apache/fop/pdf/ObjectStreamTestCase.java
AU        fop-core/src/test/java/org/apache/fop/pdf/PDFAttachmentTestCase.java
AU        fop-core/src/test/java/org/apache/fop/pdf/PDFLinkTestCase.java
AU        fop-core/src/test/java/org/apache/fop/AbstractBasicTranscoderTest.java
AU        fop-core/src/test/java/org/apache/fop/BasicPDFTranscoderTestCase.java
A         fop-core/src/test/java/org/apache/fop/util
AU        fop-core/src/test/java/org/apache/fop/util/BitmapImageUtilTestCase.java
A         fop-core/src/test/java/org/apache/fop/util/LanguageTagsTestCase.java
AU        fop-core/src/test/java/org/apache/fop/util/XMLResourceBundleTestCase.java
AU        fop-core/src/test/java/org/apache/fop/util/AdvancedMessageFormatTestCase.java
AU        fop-core/src/test/java/org/apache/fop/util/CompareUtilTestCase.java
AU        fop-core/src/test/java/org/apache/fop/util/HexEncoderTestCase.java
AU        fop-core/src/test/java/org/apache/fop/util/ElementListUtilsTestCase.java
AU        fop-core/src/test/java/org/apache/fop/util/ConsoleEventListenerForTests.java
AU        fop-core/src/test/java/org/apache/fop/util/DigestFilter.java
AU        fop-core/src/test/java/org/apache/fop/util/ColorUtilTestCase.java
A         fop-core/src/test/java/org/apache/fop/complexscripts
A         fop-core/src/test/java/org/apache/fop/complexscripts/layout
AU        fop-core/src/test/java/org/apache/fop/complexscripts/layout/ComplexScriptsLayoutTestSuite.java
AU        fop-core/src/test/java/org/apache/fop/complexscripts/layout/ComplexScriptsLayoutTestCase.java
A         fop-core/src/test/java/org/apache/fop/complexscripts/util
A         fop-core/src/test/java/org/apache/fop/complexscripts/util/NumberConverterTestCase.java
A         fop-core/src/test/java/org/apache/fop/complexscripts/util/UtilTestSuite.java
A         fop-core/src/test/java/org/apache/fop/complexscripts/bidi
A         fop-core/src/test/java/org/apache/fop/complexscripts/bidi/BidiAlgorithmTestCase.java
A         fop-core/src/test/java/org/apache/fop/complexscripts/bidi/BidiTestData.java
A         fop-core/src/test/java/org/apache/fop/complexscripts/bidi/BidiTestSuite.java
A         fop-core/src/test/java/org/apache/fop/complexscripts/bidi/BidiClassTestCase.java
A         fop-core/src/test/java/org/apache/fop/complexscripts/scripts
A         fop-core/src/test/java/org/apache/fop/complexscripts/scripts/ScriptsTestSuite.java
A         fop-core/src/test/java/org/apache/fop/complexscripts/scripts/arabic
A         fop-core/src/test/java/org/apache/fop/complexscripts/scripts/arabic/GenerateArabicTestData.java
AU        fop-core/src/test/java/org/apache/fop/complexscripts/scripts/arabic/ArabicJoinersTestCase.java
A         fop-core/src/test/java/org/apache/fop/complexscripts/scripts/arabic/ArabicWordFormsTestCase.java
A         fop-core/src/test/java/org/apache/fop/complexscripts/scripts/arabic/ArabicWordFormsConstants.java
A         fop-core/src/test/java/org/apache/fop/complexscripts/ComplexScriptsTestSuite.java
A         fop-core/src/test/java/org/apache/fop/complexscripts/fonts
A         fop-core/src/test/java/org/apache/fop/complexscripts/fonts/GSUBTestCase.java
A         fop-core/src/test/java/org/apache/fop/complexscripts/fonts/ttx
A         fop-core/src/test/java/org/apache/fop/complexscripts/fonts/ttx/TTXFileTestCase.java
A         fop-core/src/test/java/org/apache/fop/complexscripts/fonts/ttx/TTXFile.java
A         fop-core/src/test/java/org/apache/fop/complexscripts/fonts/GDEFTestCase.java
A         fop-core/src/test/java/org/apache/fop/complexscripts/fonts/FontsTestSuite.java
A         fop-core/src/test/java/org/apache/fop/complexscripts/fonts/GPOSTestCase.java
A         fop-core/src/test/java/org/apache/fop/image
A         fop-core/src/test/java/org/apache/fop/image/loader
A         fop-core/src/test/java/org/apache/fop/image/loader/batik
AU        fop-core/src/test/java/org/apache/fop/image/loader/batik/ImageLoaderTestCase.java
AU        fop-core/src/test/java/org/apache/fop/image/loader/batik/ImagePreloaderTestCase.java
A         fop-core/src/test/java/org/apache/fop/layoutmgr
AU        fop-core/src/test/java/org/apache/fop/layoutmgr/RetrieveTableMarkerLayoutManagerMakerTestCase.java
AU        fop-core/src/test/java/org/apache/fop/layoutmgr/RetrieveTableMarkerLayoutManagerTestCase.java
A         fop-core/src/test/java/org/apache/fop/layoutmgr/table
AU        fop-core/src/test/java/org/apache/fop/layoutmgr/table/TableHandler.java
AU        fop-core/src/test/java/org/apache/fop/layoutmgr/table/TableContentLayoutManagerTestCase.java
AU        fop-core/src/test/java/org/apache/fop/layoutmgr/table/TableCellLayoutManagerTestCase.java
AU        fop-core/src/test/java/org/apache/fop/layoutmgr/table/TableLayoutManagerTestCase.java
AU        fop-core/src/test/java/org/apache/fop/layoutmgr/BreakElementTestCase.java
A         fop-core/src/test/java/org/apache/fop/layoutmgr/PageSequenceLayoutManagerTestCase.java
A         fop-core/src/test/java/org/apache/fop/text
A         fop-core/src/test/java/org/apache/fop/text/linebreak
AU        fop-core/src/test/java/org/apache/fop/text/linebreak/LineBreakUtilsTestCase.java
AU        fop-core/src/test/java/org/apache/fop/text/linebreak/LineBreakStatusTestCase.java
A         fop-core/src/test/java/org/apache/fop/fotreetest
AU        fop-core/src/test/java/org/apache/fop/fotreetest/ResultCollector.java
AU        fop-core/src/test/java/org/apache/fop/fotreetest/FOTreeTestSuite.java
AU        fop-core/src/test/java/org/apache/fop/fotreetest/DummyFOEventHandler.java
AU        fop-core/src/test/java/org/apache/fop/fotreetest/FOTreeTestCase.java
A         fop-core/src/test/java/org/apache/fop/fotreetest/ext
AU        fop-core/src/test/java/org/apache/fop/fotreetest/ext/TestElementMapping.java
AU        fop-core/src/test/java/org/apache/fop/fotreetest/ext/TestObj.java
AU        fop-core/src/test/java/org/apache/fop/fotreetest/ext/AssertElement.java
AU        fop-core/src/test/java/org/apache/fop/FOPTestUtils.java
A         fop-core/src/test/java/org/apache/fop/accessibility
A         fop-core/src/test/java/org/apache/fop/accessibility/fo
A         fop-core/src/test/java/org/apache/fop/accessibility/fo/DOMResultUtil.java
AU        fop-core/src/test/java/org/apache/fop/accessibility/fo/PDFUAWarningTestCase.java
AU        fop-core/src/test/java/org/apache/fop/accessibility/fo/ArtifactImageBugTestCase.java
AU        fop-core/src/test/java/org/apache/fop/accessibility/fo/FO2StructureTreeConverterTestCase.java
A         fop-core/src/test/java/org/apache/fop/accessibility/pdf
AU        fop-core/src/test/java/org/apache/fop/accessibility/pdf/FootnoteSeparatorTestCase.java
AU        fop-core/src/test/java/org/apache/fop/accessibility/pdf/MissingLanguageWarningTestCase.java
AU        fop-core/src/test/java/org/apache/fop/BasicDriverTestSuite.java
AU        fop-core/src/test/java/org/apache/fop/UtilityCodeTestSuite.java
A         fop-core/src/test/java/org/apache/fop/fonts
AU        fop-core/src/test/java/org/apache/fop/fonts/DejaVuLGCSerifTestCase.java
AU        fop-core/src/test/java/org/apache/fop/fonts/EmbedFontInfoTestCase.java
AU        fop-core/src/test/java/org/apache/fop/fonts/FontManagerTestCase.java
AU        fop-core/src/test/java/org/apache/fop/fonts/CIDFullTestCase.java
A         fop-core/src/test/java/org/apache/fop/fonts/cff
AU        fop-core/src/test/java/org/apache/fop/fonts/cff/CFFDataReaderTestCase.java
AU        fop-core/src/test/java/org/apache/fop/fonts/FontManagerConfiguratorTestCase.java
AU        fop-core/src/test/java/org/apache/fop/fonts/FontEventProcessingTestCase.java
A         fop-core/src/test/java/org/apache/fop/fonts/truetype
AU        fop-core/src/test/java/org/apache/fop/fonts/truetype/TTFSubSetFileTestCase.java
AU        fop-core/src/test/java/org/apache/fop/fonts/truetype/TTFTableNameTestCase.java
AU        fop-core/src/test/java/org/apache/fop/fonts/truetype/OTFFileTestCase.java
AU        fop-core/src/test/java/org/apache/fop/fonts/truetype/FontFileReaderTestCase.java
AU        fop-core/src/test/java/org/apache/fop/fonts/truetype/GlyfTableTestCase.java
AU        fop-core/src/test/java/org/apache/fop/fonts/truetype/TTFFontLoaderTestCase.java
AU        fop-core/src/test/java/org/apache/fop/fonts/truetype/TTFFileTestCase.java
AU        fop-core/src/test/java/org/apache/fop/fonts/truetype/OTFSubSetFileTestCase.java
AU        fop-core/src/test/java/org/apache/fop/fonts/truetype/OTFToType1TestCase.java
A         fop-core/src/test/java/org/apache/fop/fonts/type1
AU        fop-core/src/test/java/org/apache/fop/fonts/type1/AFMParserTestCase.java
AU        fop-core/src/test/java/org/apache/fop/fonts/type1/AdobeStandardEncodingTestCase.java
AU        fop-core/src/test/java/org/apache/fop/fonts/type1/CharMetricsHandlerTestCase.java
A         fop-core/src/test/java/org/apache/fop/fonts/type1/PostscriptParserTestCase.java
A         fop-core/src/test/java/org/apache/fop/fonts/type1/Type1SubsetFileTestCase.java
AU        fop-core/src/test/java/org/apache/fop/fonts/FontsTestSuite.java
AU        fop-core/src/test/java/org/apache/fop/fonts/EncodingModeTestCase.java
AU        fop-core/src/test/java/org/apache/fop/fonts/FOPFontsTestSuite.java
A         fop-core/src/test/java/org/apache/fop/datatypes
AU        fop-core/src/test/java/org/apache/fop/datatypes/URISpecificationTestCase.java
A         fop-core/src/tools
A         fop-core/src/tools/resources
A         fop-core/src/tools/resources/checkstyle
AU        fop-core/src/tools/resources/checkstyle/suppressions.xml
A         fop-core/src/tools/resources/checkstyle/checkstyle.xml
AU        fop-core/src/tools/resources/checkstyle/checkstyle.header
A         fop-core/src/tools/resources/findbugs
AU        fop-core/src/tools/resources/findbugs/exclusions.xml
AU        pom.xml
AU        KEYS
 U        .
At revision 1784730

Parsing POMs
Established TCP socket on 42160
maven3-agent.jar already up to date
maven3-interceptor.jar already up to date
maven3-interceptor-commons.jar already up to date
[xmlgraphics-fop] $ /home/jenkins/tools/java/jdk1.6.0_20-32-unlimited-security/bin/java -Xmx2g -Xms256m -cp /home/jenkins/jenkins-slave/maven3-agent.jar:/home/jenkins/tools/maven/apache-maven-3.0.4/boot/plexus-classworlds-2.4.jar org.jvnet.hudson.maven3.agent.Maven3Main /home/jenkins/tools/maven/apache-maven-3.0.4 /home/jenkins/jenkins-slave/slave.jar /home/jenkins/jenkins-slave/maven3-interceptor.jar /home/jenkins/jenkins-slave/maven3-interceptor-commons.jar 42160
Exception in thread "main" java.lang.UnsupportedClassVersionError: hudson/remoting/Launcher : Unsupported major.minor version 51.0
        at java.lang.ClassLoader.defineClass1(Native Method)
        at java.lang.ClassLoader.defineClassCond(ClassLoader.java:632)
        at java.lang.ClassLoader.defineClass(ClassLoader.java:616)
        at java.security.SecureClassLoader.defineClass(SecureClassLoader.java:141)
        at java.net.URLClassLoader.defineClass(URLClassLoader.java:283)
        at java.net.URLClassLoader.access$000(URLClassLoader.java:58)
        at java.net.URLClassLoader$1.run(URLClassLoader.java:197)
        at java.security.AccessController.doPrivileged(Native Method)
        at java.net.URLClassLoader.findClass(URLClassLoader.java:190)
        at org.codehaus.plexus.classworlds.realm.ClassRealm.loadClassFromSelf(ClassRealm.java:386)
        at org.codehaus.plexus.classworlds.strategy.SelfFirstStrategy.loadClass(SelfFirstStrategy.java:42)
        at org.codehaus.plexus.classworlds.realm.ClassRealm.loadClass(ClassRealm.java:244)
        at org.codehaus.plexus.classworlds.realm.ClassRealm.loadClass(ClassRealm.java:230)
        at org.jvnet.hudson.maven3.agent.Maven3Main.main(Maven3Main.java:138)
        at org.jvnet.hudson.maven3.agent.Maven3Main.main(Maven3Main.java:70)
ERROR: Failed to parse POMs
java.io.EOFException: unexpected stream termination
        at hudson.remoting.ChannelBuilder.negotiate(ChannelBuilder.java:365)
        at hudson.remoting.ChannelBuilder.build(ChannelBuilder.java:310)
        at hudson.slaves.Channels.forProcess(Channels.java:115)
        at hudson.maven.AbstractMavenProcessFactory.newProcess(AbstractMavenProcessFactory.java:294)
        at hudson.maven.ProcessCache.get(ProcessCache.java:236)
        at hudson.maven.MavenModuleSetBuild$MavenModuleSetBuildExecution.doRun(MavenModuleSetBuild.java:798)
        at hudson.model.AbstractBuild$AbstractBuildExecution.run(AbstractBuild.java:534)
        at hudson.model.Run.execute(Run.java:1728)
        at hudson.maven.MavenModuleSetBuild.run(MavenModuleSetBuild.java:544)
        at hudson.model.ResourceController.execute(ResourceController.java:98)
        at hudson.model.Executor.run(Executor.java:404)
Reply | Threaded
Open this post in threaded view
|  
Report Content as Inappropriate

Build failed in Jenkins: xmlgraphics-fop #93

Apache Jenkins Server
See <https://builds.apache.org/job/xmlgraphics-fop/93/display/redirect>

------------------------------------------
Started by user ssteiner
[EnvInject] - Loading node environment variables.
Building remotely on H14 (ubuntu) in workspace <https://builds.apache.org/job/xmlgraphics-fop/ws/>
Updating https://svn.apache.org/repos/asf/xmlgraphics/fop/trunk at revision '2017-02-28T12:09:06.672 +0000'
At revision 1784730

No changes for https://svn.apache.org/repos/asf/xmlgraphics/fop/trunk since the previous build
Parsing POMs
Established TCP socket on 38711
maven3-agent.jar already up to date
maven3-interceptor.jar already up to date
maven3-interceptor-commons.jar already up to date
[xmlgraphics-fop] $ /home/jenkins/tools/java/jdk1.6.0_20-32-unlimited-security/bin/java -Xmx2g -Xms256m -cp /home/jenkins/jenkins-slave/maven3-agent.jar:/home/jenkins/tools/maven/apache-maven-3.0.5/boot/plexus-classworlds-2.4.jar org.jvnet.hudson.maven3.agent.Maven3Main /home/jenkins/tools/maven/apache-maven-3.0.5 /home/jenkins/jenkins-slave/slave.jar /home/jenkins/jenkins-slave/maven3-interceptor.jar /home/jenkins/jenkins-slave/maven3-interceptor-commons.jar 38711
Exception in thread "main" java.lang.UnsupportedClassVersionError: hudson/remoting/Launcher : Unsupported major.minor version 51.0
        at java.lang.ClassLoader.defineClass1(Native Method)
        at java.lang.ClassLoader.defineClassCond(ClassLoader.java:632)
        at java.lang.ClassLoader.defineClass(ClassLoader.java:616)
        at java.security.SecureClassLoader.defineClass(SecureClassLoader.java:141)
        at java.net.URLClassLoader.defineClass(URLClassLoader.java:283)
        at java.net.URLClassLoader.access$000(URLClassLoader.java:58)
        at java.net.URLClassLoader$1.run(URLClassLoader.java:197)
        at java.security.AccessController.doPrivileged(Native Method)
        at java.net.URLClassLoader.findClass(URLClassLoader.java:190)
        at org.codehaus.plexus.classworlds.realm.ClassRealm.loadClassFromSelf(ClassRealm.java:386)
        at org.codehaus.plexus.classworlds.strategy.SelfFirstStrategy.loadClass(SelfFirstStrategy.java:42)
        at org.codehaus.plexus.classworlds.realm.ClassRealm.loadClass(ClassRealm.java:244)
        at org.codehaus.plexus.classworlds.realm.ClassRealm.loadClass(ClassRealm.java:230)
        at org.jvnet.hudson.maven3.agent.Maven3Main.main(Maven3Main.java:138)
        at org.jvnet.hudson.maven3.agent.Maven3Main.main(Maven3Main.java:70)
ERROR: Failed to parse POMs
java.io.EOFException: unexpected stream termination
        at hudson.remoting.ChannelBuilder.negotiate(ChannelBuilder.java:365)
        at hudson.remoting.ChannelBuilder.build(ChannelBuilder.java:310)
        at hudson.slaves.Channels.forProcess(Channels.java:115)
        at hudson.maven.AbstractMavenProcessFactory.newProcess(AbstractMavenProcessFactory.java:294)
        at hudson.maven.ProcessCache.get(ProcessCache.java:236)
        at hudson.maven.MavenModuleSetBuild$MavenModuleSetBuildExecution.doRun(MavenModuleSetBuild.java:798)
        at hudson.model.AbstractBuild$AbstractBuildExecution.run(AbstractBuild.java:534)
        at hudson.model.Run.execute(Run.java:1728)
        at hudson.maven.MavenModuleSetBuild.run(MavenModuleSetBuild.java:544)
        at hudson.model.ResourceController.execute(ResourceController.java:98)
        at hudson.model.Executor.run(Executor.java:404)
Reply | Threaded
Open this post in threaded view
|  
Report Content as Inappropriate

Build failed in Jenkins: xmlgraphics-fop #94

Apache Jenkins Server
See <https://builds.apache.org/job/xmlgraphics-fop/94/display/redirect>

------------------------------------------
Started by user ssteiner
[EnvInject] - Loading node environment variables.
Building remotely on H14 (ubuntu) in workspace <https://builds.apache.org/job/xmlgraphics-fop/ws/>
Updating https://svn.apache.org/repos/asf/xmlgraphics/fop/trunk at revision '2017-02-28T12:10:08.098 +0000'
At revision 1784731

No changes for https://svn.apache.org/repos/asf/xmlgraphics/fop/trunk since the previous build
Parsing POMs
Established TCP socket on 34192
Copied maven-agent.jar
classworlds.jar already up to date
Copied maven-interceptor.jar
maven2.1-interceptor.jar already up to date
[xmlgraphics-fop] $ /home/jenkins/tools/java/jdk1.6.0_20-32-unlimited-security/bin/java -Xmx2g -Xms256m -cp /home/jenkins/jenkins-slave/maven-agent.jar:/home/jenkins/jenkins-slave/classworlds.jar hudson.maven.agent.Main /home/jenkins/tools/maven/apache-maven-2.2.1 /home/jenkins/jenkins-slave/slave.jar /home/jenkins/jenkins-slave/maven-interceptor.jar 34192 /home/jenkins/jenkins-slave/maven2.1-interceptor.jar
Exception in thread "main" java.lang.UnsupportedClassVersionError: hudson/remoting/Launcher : Unsupported major.minor version 51.0
        at java.lang.ClassLoader.defineClass1(Native Method)
        at java.lang.ClassLoader.defineClassCond(ClassLoader.java:632)
        at java.lang.ClassLoader.defineClass(ClassLoader.java:616)
        at java.security.SecureClassLoader.defineClass(SecureClassLoader.java:141)
        at java.net.URLClassLoader.defineClass(URLClassLoader.java:283)
        at java.net.URLClassLoader.access$000(URLClassLoader.java:58)
        at java.net.URLClassLoader$1.run(URLClassLoader.java:197)
        at java.security.AccessController.doPrivileged(Native Method)
        at java.net.URLClassLoader.findClass(URLClassLoader.java:190)
        at java.lang.ClassLoader.loadClass(ClassLoader.java:307)
        at org.codehaus.classworlds.RealmClassLoader.loadClassDirect(RealmClassLoader.java:195)
        at org.codehaus.classworlds.DefaultClassRealm.loadClass(DefaultClassRealm.java:255)
        at hudson.maven.agent.Main.main(Main.java:143)
        at hudson.maven.agent.Main.main(Main.java:68)
ERROR: Failed to parse POMs
java.io.EOFException: unexpected stream termination
        at hudson.remoting.ChannelBuilder.negotiate(ChannelBuilder.java:365)
        at hudson.remoting.ChannelBuilder.build(ChannelBuilder.java:310)
        at hudson.slaves.Channels.forProcess(Channels.java:115)
        at hudson.maven.AbstractMavenProcessFactory.newProcess(AbstractMavenProcessFactory.java:294)
        at hudson.maven.ProcessCache.get(ProcessCache.java:236)
        at hudson.maven.MavenModuleSetBuild$MavenModuleSetBuildExecution.doRun(MavenModuleSetBuild.java:798)
        at hudson.model.AbstractBuild$AbstractBuildExecution.run(AbstractBuild.java:534)
        at hudson.model.Run.execute(Run.java:1728)
        at hudson.maven.MavenModuleSetBuild.run(MavenModuleSetBuild.java:544)
        at hudson.model.ResourceController.execute(ResourceController.java:98)
        at hudson.model.Executor.run(Executor.java:404)
Reply | Threaded
Open this post in threaded view
|  
Report Content as Inappropriate

Jenkins build is back to normal : xmlgraphics-fop #95

Apache Jenkins Server
Loading...