Build failed in Jenkins: xmlgraphics-fop #285

classic Classic list List threaded Threaded
5 messages Options
Reply | Threaded
Open this post in threaded view
|

Build failed in Jenkins: xmlgraphics-fop #285

Apache Jenkins Server
See <https://builds.apache.org/job/xmlgraphics-fop/285/display/redirect?page=changes>

Changes:

[ssteiner] FOP-2923: Allow to suppress fo:leader within empty paragaphs from structure tree


------------------------------------------
[...truncated 995 B...]

No JDK named ?JDK 1.8.0_144 (unlimited security)? found
No JDK named ?JDK 1.8.0_144 (unlimited security)? found
Parsing POMs
Established TCP socket on 37365
maven33-agent.jar already up to date
maven33-interceptor.jar already up to date
maven3-interceptor-commons.jar already up to date
[xmlgraphics-fop] $ java -Xmx4g -Xms4g -cp /home/jenkins/jenkins-slave/maven33-agent.jar:/home/jenkins/tools/maven/apache-maven-3.3.9/boot/plexus-classworlds-2.5.2.jar:/home/jenkins/tools/maven/apache-maven-3.3.9/conf/logging jenkins.maven3.agent.Maven33Main /home/jenkins/tools/maven/apache-maven-3.3.9 /home/jenkins/jenkins-slave/remoting.jar /home/jenkins/jenkins-slave/maven33-interceptor.jar /home/jenkins/jenkins-slave/maven3-interceptor-commons.jar 37365
<===[JENKINS REMOTING CAPACITY]===>   channel started
Executing Maven:  -B -f <https://builds.apache.org/job/xmlgraphics-fop/ws/pom.xml> -Dmaven.repo.local=/home/jenkins/jenkins-slave/maven-repositories/1 clean install checkstyle:checkstyle findbugs:findbugs -B -U -e -fae -V -Djdk.path=/home/jenkins/tools/java/jdk1.7.0_79-unlimited-security
Apache Maven 3.3.9 (bb52d8502b132ec0a5a3f4c09453c07478323dc5; 2015-11-10T16:41:47+00:00)
Maven home: /usr/local/asfpackages/maven/apache-maven-3.3.9
Java version: 11.0.6, vendor: Ubuntu
Java home: /usr/lib/jvm/java-11-openjdk-amd64
Default locale: en_US, platform encoding: ISO-8859-1
OS name: "linux", version: "4.15.0-76-generic", arch: "amd64", family: "unix"
[INFO] Error stacktraces are turned on.
[INFO] Scanning for projects...
[INFO] ------------------------------------------------------------------------
[INFO] Reactor Build Order:
[INFO]
[INFO] Apache FOP Parent
[INFO] Apache FOP Utilities
[INFO] Apache FOP Events
[INFO] Apache FOP Core
[INFO] Apache FOP All-In-One
[INFO] Apache FOP Sandbox
[INFO] Apache FOP Servlet
[INFO] Apache FOP Transcoder
[INFO] Apache FOP Transcoder All-In-One
[INFO] Downloading: https://repo.maven.apache.org/maven2/org/apache/maven/plugins/maven-javadoc-plugin/maven-metadata.xml
[INFO] Downloaded: https://repo.maven.apache.org/maven2/org/apache/maven/plugins/maven-javadoc-plugin/maven-metadata.xml (2 KB at 3.1 KB/sec)
[INFO] Downloading: https://repo.maven.apache.org/maven2/org/apache/maven/plugins/maven-javadoc-plugin/3.2.0/maven-javadoc-plugin-3.2.0.pom
[INFO] Downloaded: https://repo.maven.apache.org/maven2/org/apache/maven/plugins/maven-javadoc-plugin/3.2.0/maven-javadoc-plugin-3.2.0.pom (20 KB at 680.3 KB/sec)
[INFO] Downloading: https://repo.maven.apache.org/maven2/org/apache/maven/plugins/maven-javadoc-plugin/3.2.0/maven-javadoc-plugin-3.2.0.jar
[INFO] Downloaded: https://repo.maven.apache.org/maven2/org/apache/maven/plugins/maven-javadoc-plugin/3.2.0/maven-javadoc-plugin-3.2.0.jar (481 KB at 5652.9 KB/sec)
[INFO] Downloading: https://repo.maven.apache.org/maven2/org/apache/maven/plugins/maven-site-plugin/3.3/maven-site-plugin-3.3.pom
[INFO] Downloaded: https://repo.maven.apache.org/maven2/org/apache/maven/plugins/maven-site-plugin/3.3/maven-site-plugin-3.3.pom (21 KB at 1129.2 KB/sec)
[INFO] Downloading: https://repo.maven.apache.org/maven2/org/apache/maven/plugins/maven-site-plugin/3.3/maven-site-plugin-3.3.jar
[INFO] Downloaded: https://repo.maven.apache.org/maven2/org/apache/maven/plugins/maven-site-plugin/3.3/maven-site-plugin-3.3.jar (122 KB at 4048.1 KB/sec)
[INFO] Downloading: https://repo.maven.apache.org/maven2/org/apache/maven/plugins/maven-assembly-plugin/2.2-beta-5/maven-assembly-plugin-2.2-beta-5.pom
[INFO] Downloaded: https://repo.maven.apache.org/maven2/org/apache/maven/plugins/maven-assembly-plugin/2.2-beta-5/maven-assembly-plugin-2.2-beta-5.pom (15 KB at 870.8 KB/sec)
[INFO] Downloading: https://repo.maven.apache.org/maven2/org/apache/maven/plugins/maven-plugins/16/maven-plugins-16.pom
[INFO] Downloaded: https://repo.maven.apache.org/maven2/org/apache/maven/plugins/maven-plugins/16/maven-plugins-16.pom (13 KB at 790.3 KB/sec)
[INFO] Downloading: https://repo.maven.apache.org/maven2/org/apache/maven/plugins/maven-assembly-plugin/2.2-beta-5/maven-assembly-plugin-2.2-beta-5.jar
[INFO] Downloaded: https://repo.maven.apache.org/maven2/org/apache/maven/plugins/maven-assembly-plugin/2.2-beta-5/maven-assembly-plugin-2.2-beta-5.jar (204 KB at 5512.7 KB/sec)
[INFO] Downloading: https://repo.maven.apache.org/maven2/org/apache/maven/plugins/maven-dependency-plugin/2.8/maven-dependency-plugin-2.8.pom
[INFO] Downloaded: https://repo.maven.apache.org/maven2/org/apache/maven/plugins/maven-dependency-plugin/2.8/maven-dependency-plugin-2.8.pom (12 KB at 658.0 KB/sec)
[INFO] Downloading: https://repo.maven.apache.org/maven2/org/apache/maven/plugins/maven-dependency-plugin/2.8/maven-dependency-plugin-2.8.jar
[INFO] Downloaded: https://repo.maven.apache.org/maven2/org/apache/maven/plugins/maven-dependency-plugin/2.8/maven-dependency-plugin-2.8.jar (150 KB at 5158.4 KB/sec)
[INFO] Downloading: https://repo.maven.apache.org/maven2/org/apache/maven/plugins/maven-release-plugin/2.3.2/maven-release-plugin-2.3.2.pom
[INFO] Downloaded: https://repo.maven.apache.org/maven2/org/apache/maven/plugins/maven-release-plugin/2.3.2/maven-release-plugin-2.3.2.pom (10 KB at 568.2 KB/sec)
[INFO] Downloading: https://repo.maven.apache.org/maven2/org/apache/maven/release/maven-release/2.3.2/maven-release-2.3.2.pom
[INFO] Downloaded: https://repo.maven.apache.org/maven2/org/apache/maven/release/maven-release/2.3.2/maven-release-2.3.2.pom (9 KB at 495.3 KB/sec)
[INFO] Downloading: https://repo.maven.apache.org/maven2/org/apache/maven/plugins/maven-release-plugin/2.3.2/maven-release-plugin-2.3.2.jar
[INFO] Downloaded: https://repo.maven.apache.org/maven2/org/apache/maven/plugins/maven-release-plugin/2.3.2/maven-release-plugin-2.3.2.jar (44 KB at 2063.1 KB/sec)
[INFO] Downloading: https://repo.maven.apache.org/maven2/org/apache/maven/plugins/maven-checkstyle-plugin/2.14/maven-checkstyle-plugin-2.14.pom
[INFO] Downloaded: https://repo.maven.apache.org/maven2/org/apache/maven/plugins/maven-checkstyle-plugin/2.14/maven-checkstyle-plugin-2.14.pom (14 KB at 728.7 KB/sec)
[INFO] Downloading: https://repo.maven.apache.org/maven2/org/apache/maven/plugins/maven-checkstyle-plugin/2.14/maven-checkstyle-plugin-2.14.jar
[INFO] Downloaded: https://repo.maven.apache.org/maven2/org/apache/maven/plugins/maven-checkstyle-plugin/2.14/maven-checkstyle-plugin-2.14.jar (108 KB at 3696.4 KB/sec)
[INFO] Downloading: https://repo.maven.apache.org/maven2/org/apache/maven/plugins/maven-project-info-reports-plugin/2.8/maven-project-info-reports-plugin-2.8.pom
[INFO] Downloaded: https://repo.maven.apache.org/maven2/org/apache/maven/plugins/maven-project-info-reports-plugin/2.8/maven-project-info-reports-plugin-2.8.pom (19 KB at 889.0 KB/sec)
[INFO] Downloading: https://repo.maven.apache.org/maven2/org/apache/maven/plugins/maven-project-info-reports-plugin/2.8/maven-project-info-reports-plugin-2.8.jar
[INFO] Downloaded: https://repo.maven.apache.org/maven2/org/apache/maven/plugins/maven-project-info-reports-plugin/2.8/maven-project-info-reports-plugin-2.8.jar (294 KB at 6822.4 KB/sec)
[INFO] Downloading: https://repo.maven.apache.org/maven2/org/codehaus/mojo/maven-metadata.xml
[INFO] Downloading: https://repo.maven.apache.org/maven2/org/apache/maven/plugins/maven-metadata.xml
[INFO] Downloaded: https://repo.maven.apache.org/maven2/org/codehaus/mojo/maven-metadata.xml (20 KB at 999.6 KB/sec)
[INFO] Downloaded: https://repo.maven.apache.org/maven2/org/apache/maven/plugins/maven-metadata.xml (14 KB at 324.2 KB/sec)
[INFO] Downloading: https://repo.maven.apache.org/maven2/org/codehaus/mojo/findbugs-maven-plugin/maven-metadata.xml
[INFO] Downloaded: https://repo.maven.apache.org/maven2/org/codehaus/mojo/findbugs-maven-plugin/maven-metadata.xml (2 KB at 37.4 KB/sec)
[INFO]                                                                        
[INFO] ------------------------------------------------------------------------
[INFO] Building Apache FOP Parent 2.5.0-SNAPSHOT
[INFO] ------------------------------------------------------------------------
[INFO]
[INFO] --- maven-clean-plugin:2.5:clean (default-clean) @ fop-parent ---
[INFO] Deleting <https://builds.apache.org/job/xmlgraphics-fop/ws/target>
[INFO]
[INFO] --- maven-install-plugin:2.4:install (default-install) @ fop-parent ---
[INFO] Installing <https://builds.apache.org/job/xmlgraphics-fop/ws/pom.xml> to /home/jenkins/jenkins-slave/maven-repositories/1/org/apache/xmlgraphics/fop-parent/2.5.0-SNAPSHOT/fop-parent-2.5.0-SNAPSHOT.pom
[INFO]
[INFO] --- maven-checkstyle-plugin:2.14:checkstyle (default-cli) @ fop-parent ---
[INFO] Downloading: https://repo.maven.apache.org/maven2/com/puppycrawl/tools/checkstyle/5.8/checkstyle-5.8.pom
[INFO] Downloaded: https://repo.maven.apache.org/maven2/com/puppycrawl/tools/checkstyle/5.8/checkstyle-5.8.pom (26 KB at 291.5 KB/sec)
[INFO] Downloading: https://repo.maven.apache.org/maven2/com/google/guava/guava-jdk5/14.0.1/guava-jdk5-14.0.1.pom
[INFO] Downloaded: https://repo.maven.apache.org/maven2/com/google/guava/guava-jdk5/14.0.1/guava-jdk5-14.0.1.pom (7 KB at 391.2 KB/sec)
[INFO] Downloading: https://repo.maven.apache.org/maven2/com/google/guava/guava-parent-jdk5/14.0.1/guava-parent-jdk5-14.0.1.pom
[INFO] Downloaded: https://repo.maven.apache.org/maven2/com/google/guava/guava-parent-jdk5/14.0.1/guava-parent-jdk5-14.0.1.pom (3 KB at 184.0 KB/sec)
[INFO] Downloading: https://repo.maven.apache.org/maven2/com/puppycrawl/tools/checkstyle/5.8/checkstyle-5.8.jar
[INFO] Downloading: https://repo.maven.apache.org/maven2/com/google/guava/guava-jdk5/14.0.1/guava-jdk5-14.0.1.jar
[INFO] Downloaded: https://repo.maven.apache.org/maven2/com/puppycrawl/tools/checkstyle/5.8/checkstyle-5.8.jar (694 KB at 8457.8 KB/sec)
[INFO] Downloaded: https://repo.maven.apache.org/maven2/com/google/guava/guava-jdk5/14.0.1/guava-jdk5-14.0.1.jar (1957 KB at 13973.7 KB/sec)
[WARNING] Attempt to (de-)serialize anonymous class hudson.plugins.analysis.core.HealthAwareReporter$2; see: https://jenkins.io/redirect/serialization-of-anonymous-classes/
[WARNING] Attempt to (de-)serialize anonymous class hudson.plugins.analysis.core.HealthAwareReporter$3; see: https://jenkins.io/redirect/serialization-of-anonymous-classes/
[CHECKSTYLE] No report found for mojo checkstyle
[INFO]
[INFO] --- findbugs-maven-plugin:3.0.5:findbugs (default-cli) @ fop-parent ---
WARNING: An illegal reflective access operation has occurred
WARNING: Illegal reflective access by org.codehaus.groovy.reflection.CachedClass (file:/home/jenkins/jenkins-slave/maven-repositories/1/org/codehaus/groovy/groovy/2.4.12/groovy-2.4.12.jar) to method java.lang.Object.finalize()
WARNING: Please consider reporting this to the maintainers of org.codehaus.groovy.reflection.CachedClass
WARNING: Use --illegal-access=warn to enable warnings of further illegal reflective access operations
WARNING: All illegal access operations will be denied in a future release
[FINDBUGS] No report found for mojo findbugs
[INFO]                                                                        
[INFO] ------------------------------------------------------------------------
[INFO] Building Apache FOP Utilities 2.5.0-SNAPSHOT
[INFO] ------------------------------------------------------------------------
[INFO] Downloading: https://repo.maven.apache.org/maven2/org/codehaus/mojo/findbugs-maven-plugin/3.0.4/findbugs-maven-plugin-3.0.4.pom
[INFO] Downloaded: https://repo.maven.apache.org/maven2/org/codehaus/mojo/findbugs-maven-plugin/3.0.4/findbugs-maven-plugin-3.0.4.pom (22 KB at 897.8 KB/sec)
[INFO] Downloading: https://repo.maven.apache.org/maven2/org/codehaus/mojo/mojo-parent/35/mojo-parent-35.pom
[INFO] Downloaded: https://repo.maven.apache.org/maven2/org/codehaus/mojo/mojo-parent/35/mojo-parent-35.pom (25 KB at 1351.0 KB/sec)
[INFO] Downloading: https://repo.maven.apache.org/maven2/org/codehaus/mojo/findbugs-maven-plugin/3.0.4/findbugs-maven-plugin-3.0.4.jar
[INFO] Downloaded: https://repo.maven.apache.org/maven2/org/codehaus/mojo/findbugs-maven-plugin/3.0.4/findbugs-maven-plugin-3.0.4.jar (143 KB at 5268.3 KB/sec)
[INFO] Downloading: https://repository.jboss.org/nexus/content/repositories/thirdparty-releases/org/apache/xmlgraphics/xmlgraphics-commons/2.4.0-SNAPSHOT/maven-metadata.xml
[INFO] Downloading: https://repository.apache.org/content/repositories/snapshots/org/apache/xmlgraphics/xmlgraphics-commons/2.4.0-SNAPSHOT/maven-metadata.xml
[INFO] Downloaded: https://repository.apache.org/content/repositories/snapshots/org/apache/xmlgraphics/xmlgraphics-commons/2.4.0-SNAPSHOT/maven-metadata.xml (794 B at 1.2 KB/sec)
[INFO] Downloading: https://repository.apache.org/content/repositories/snapshots/org/apache/xmlgraphics/xmlgraphics-commons/2.4.0-SNAPSHOT/xmlgraphics-commons-2.4.0-20191024.105137-10.pom
[INFO] Downloaded: https://repository.apache.org/content/repositories/snapshots/org/apache/xmlgraphics/xmlgraphics-commons/2.4.0-SNAPSHOT/xmlgraphics-commons-2.4.0-20191024.105137-10.pom (8 KB at 11.2 KB/sec)
[INFO] Downloading: https://repository.apache.org/content/repositories/snapshots/org/apache/xmlgraphics/xmlgraphics-commons/2.4.0-SNAPSHOT/xmlgraphics-commons-2.4.0-20191024.105137-10.jar
[INFO] Downloaded: https://repository.apache.org/content/repositories/snapshots/org/apache/xmlgraphics/xmlgraphics-commons/2.4.0-SNAPSHOT/xmlgraphics-commons-2.4.0-20191024.105137-10.jar (659 KB at 635.2 KB/sec)
[INFO]
[INFO] --- maven-clean-plugin:2.5:clean (default-clean) @ fop-util ---
[INFO] Deleting <https://builds.apache.org/job/xmlgraphics-fop/ws/fop-util/target>
[INFO]
[INFO] --- maven-resources-plugin:2.6:resources (default-resources) @ fop-util ---
[INFO] Using 'UTF-8' encoding to copy filtered resources.
[INFO] skip non existing resourceDirectory <https://builds.apache.org/job/xmlgraphics-fop/ws/fop-util/src/main/resources>
[INFO] Copying 2 resources to META-INF
[INFO]
[INFO] --- maven-compiler-plugin:3.1:compile (default-compile) @ fop-util ---
[INFO] Changes detected - recompiling the module!
[INFO] Compiling 3 source files to <https://builds.apache.org/job/xmlgraphics-fop/ws/fop-util/target/classes>
[INFO]                                                                        
[INFO] ------------------------------------------------------------------------
[INFO] Skipping Apache FOP Events
[INFO] This project has been banned from the build due to previous failures.
[INFO] ------------------------------------------------------------------------
[INFO]                                                                        
[INFO] ------------------------------------------------------------------------
[INFO] Skipping Apache FOP Core
[INFO] This project has been banned from the build due to previous failures.
[INFO] ------------------------------------------------------------------------
[INFO]                                                                        
[INFO] ------------------------------------------------------------------------
[INFO] Skipping Apache FOP All-In-One
[INFO] This project has been banned from the build due to previous failures.
[INFO] ------------------------------------------------------------------------
[INFO]                                                                        
[INFO] ------------------------------------------------------------------------
[INFO] Skipping Apache FOP Sandbox
[INFO] This project has been banned from the build due to previous failures.
[INFO] ------------------------------------------------------------------------
[INFO]                                                                        
[INFO] ------------------------------------------------------------------------
[INFO] Skipping Apache FOP Servlet
[INFO] This project has been banned from the build due to previous failures.
[INFO] ------------------------------------------------------------------------
[INFO]                                                                        
[INFO] ------------------------------------------------------------------------
[INFO] Skipping Apache FOP Transcoder
[INFO] This project has been banned from the build due to previous failures.
[INFO] ------------------------------------------------------------------------
[INFO]                                                                        
[INFO] ------------------------------------------------------------------------
[INFO] Skipping Apache FOP Transcoder All-In-One
[INFO] This project has been banned from the build due to previous failures.
[INFO] ------------------------------------------------------------------------
[INFO] ------------------------------------------------------------------------
[INFO] Reactor Summary:
[INFO]
[INFO] Apache FOP Parent .................................. SUCCESS [ 16.291 s]
[INFO] Apache FOP Utilities ............................... FAILURE [  4.361 s]
[INFO] Apache FOP Events .................................. SKIPPED
[INFO] Apache FOP Core .................................... SKIPPED
[INFO] Apache FOP All-In-One .............................. SKIPPED
[INFO] Apache FOP Sandbox ................................. SKIPPED
[INFO] Apache FOP Servlet ................................. SKIPPED
[INFO] Apache FOP Transcoder .............................. SKIPPED
[INFO] Apache FOP Transcoder All-In-One ................... SKIPPED
[INFO] ------------------------------------------------------------------------
[INFO] BUILD FAILURE
[INFO] ------------------------------------------------------------------------
[INFO] Total time: 37.407 s
[INFO] Finished at: 2020-03-25T12:49:22+00:00
[INFO] Final Memory: 40M/4096M
[INFO] ------------------------------------------------------------------------
Waiting for Jenkins to finish collecting data
[ERROR] Failed to execute goal org.apache.maven.plugins:maven-compiler-plugin:3.1:compile (default-compile) on project fop-util: Compilation failure -> [Help 1]
org.apache.maven.lifecycle.LifecycleExecutionException: Failed to execute goal org.apache.maven.plugins:maven-compiler-plugin:3.1:compile (default-compile) on project fop-util: Compilation failure
        at org.apache.maven.lifecycle.internal.MojoExecutor.execute(MojoExecutor.java:212)
        at org.apache.maven.lifecycle.internal.MojoExecutor.execute(MojoExecutor.java:153)
        at org.apache.maven.lifecycle.internal.MojoExecutor.execute(MojoExecutor.java:145)
        at org.apache.maven.lifecycle.internal.LifecycleModuleBuilder.buildProject(LifecycleModuleBuilder.java:116)
        at org.apache.maven.lifecycle.internal.LifecycleModuleBuilder.buildProject(LifecycleModuleBuilder.java:80)
        at org.apache.maven.lifecycle.internal.builder.singlethreaded.SingleThreadedBuilder.build(SingleThreadedBuilder.java:51)
        at org.apache.maven.lifecycle.internal.LifecycleStarter.execute(LifecycleStarter.java:128)
        at org.apache.maven.DefaultMaven.doExecute(DefaultMaven.java:307)
        at org.apache.maven.DefaultMaven.doExecute(DefaultMaven.java:193)
        at org.apache.maven.DefaultMaven.execute(DefaultMaven.java:106)
        at org.jvnet.hudson.maven3.launcher.Maven33Launcher.main(Maven33Launcher.java:129)
        at java.base/jdk.internal.reflect.NativeMethodAccessorImpl.invoke0(Native Method)
        at java.base/jdk.internal.reflect.NativeMethodAccessorImpl.invoke(NativeMethodAccessorImpl.java:62)
        at java.base/jdk.internal.reflect.DelegatingMethodAccessorImpl.invoke(DelegatingMethodAccessorImpl.java:43)
        at java.base/java.lang.reflect.Method.invoke(Method.java:566)
        at org.codehaus.plexus.classworlds.launcher.Launcher.launchStandard(Launcher.java:330)
        at org.codehaus.plexus.classworlds.launcher.Launcher.launch(Launcher.java:238)
        at jenkins.maven3.agent.Maven33Main.launch(Maven33Main.java:178)
        at java.base/jdk.internal.reflect.NativeMethodAccessorImpl.invoke0(Native Method)
        at java.base/jdk.internal.reflect.NativeMethodAccessorImpl.invoke(NativeMethodAccessorImpl.java:62)
        at java.base/jdk.internal.reflect.DelegatingMethodAccessorImpl.invoke(DelegatingMethodAccessorImpl.java:43)
        at java.base/java.lang.reflect.Method.invoke(Method.java:566)
        at hudson.maven.Maven3Builder.call(Maven3Builder.java:139)
        at hudson.maven.Maven3Builder.call(Maven3Builder.java:70)
        at hudson.remoting.UserRequest.perform(UserRequest.java:212)
        at hudson.remoting.UserRequest.perform(UserRequest.java:54)
        at hudson.remoting.Request$2.run(Request.java:369)
        at hudson.remoting.InterceptingExecutorService$1.call(InterceptingExecutorService.java:72)
        at java.base/java.util.concurrent.FutureTask.run(FutureTask.java:264)
        at java.base/java.util.concurrent.ThreadPoolExecutor.runWorker(ThreadPoolExecutor.java:1128)
        at java.base/java.util.concurrent.ThreadPoolExecutor$Worker.run(ThreadPoolExecutor.java:628)
        at java.base/java.lang.Thread.run(Thread.java:834)
Caused by: org.apache.maven.plugin.compiler.CompilationFailureException: Compilation failure
        at org.apache.maven.plugin.compiler.AbstractCompilerMojo.execute(AbstractCompilerMojo.java:862)
        at org.apache.maven.plugin.compiler.CompilerMojo.execute(CompilerMojo.java:129)
        at org.apache.maven.plugin.DefaultBuildPluginManager.executeMojo(DefaultBuildPluginManager.java:134)
        at org.apache.maven.lifecycle.internal.MojoExecutor.execute(MojoExecutor.java:207)
        ... 31 more
[ERROR]
[ERROR] Re-run Maven using the -X switch to enable full debug logging.
[ERROR]
[ERROR] For more information about the errors and possible solutions, please read the following articles:
[ERROR] [Help 1] http://cwiki.apache.org/confluence/display/MAVEN/MojoFailureException
[ERROR]
[ERROR] After correcting the problems, you can resume the build with the command
[ERROR]   mvn <goals> -rf :fop-util
[JENKINS] Archiving <https://builds.apache.org/job/xmlgraphics-fop/ws/fop-sandbox/pom.xml> to org.apache.xmlgraphics/fop-sandbox/2.5.0-SNAPSHOT/fop-sandbox-2.5.0-SNAPSHOT.pom
[JENKINS] Archiving <https://builds.apache.org/job/xmlgraphics-fop/ws/pom.xml> to org.apache.xmlgraphics/fop-parent/2.5.0-SNAPSHOT/fop-parent-2.5.0-SNAPSHOT.pom
[JENKINS] Archiving <https://builds.apache.org/job/xmlgraphics-fop/ws/fop-core/pom.xml> to org.apache.xmlgraphics/fop-core/2.5.0-SNAPSHOT/fop-core-2.5.0-SNAPSHOT.pom
[JENKINS] Archiving <https://builds.apache.org/job/xmlgraphics-fop/ws/fop/pom.xml> to org.apache.xmlgraphics/fop/2.5.0-SNAPSHOT/fop-2.5.0-SNAPSHOT.pom
[JENKINS] Archiving <https://builds.apache.org/job/xmlgraphics-fop/ws/fop-servlet/pom.xml> to org.apache.xmlgraphics/fop-servlet/2.5.0-SNAPSHOT/fop-servlet-2.5.0-SNAPSHOT.pom
[JENKINS] Archiving <https://builds.apache.org/job/xmlgraphics-fop/ws/fop-transcoder-allinone/pom.xml> to org.apache.xmlgraphics/fop-transcoder-allinone/2.5.0-SNAPSHOT/fop-transcoder-allinone-2.5.0-SNAPSHOT.pom
[JENKINS] Archiving <https://builds.apache.org/job/xmlgraphics-fop/ws/fop-util/pom.xml> to org.apache.xmlgraphics/fop-util/2.5.0-SNAPSHOT/fop-util-2.5.0-SNAPSHOT.pom
[JENKINS] Archiving <https://builds.apache.org/job/xmlgraphics-fop/ws/fop-events/pom.xml> to org.apache.xmlgraphics/fop-events/2.5.0-SNAPSHOT/fop-events-2.5.0-SNAPSHOT.pom
[JENKINS] Archiving <https://builds.apache.org/job/xmlgraphics-fop/ws/fop-transcoder/pom.xml> to org.apache.xmlgraphics/fop-transcoder/2.5.0-SNAPSHOT/fop-transcoder-2.5.0-SNAPSHOT.pom
channel stopped
No JDK named ?JDK 1.8.0_144 (unlimited security)? found
No JDK named ?JDK 1.8.0_144 (unlimited security)? found
No JDK named ?JDK 1.8.0_144 (unlimited security)? found
Reply | Threaded
Open this post in threaded view
|

Build failed in Jenkins: xmlgraphics-fop #286

Apache Jenkins Server
See <https://builds.apache.org/job/xmlgraphics-fop/286/display/redirect?page=changes>

Changes:

[ssteiner] FOP-2924: Images not scaled or rotated in PCL


------------------------------------------
[...truncated 349.79 KB...]
AU        fop-sandbox/src/main/java/org/apache/fop/render/svg/package.html
A         fop-sandbox/src/main/resources
A         fop-sandbox/src/main/resources/META-INF
A         fop-sandbox/src/main/resources/META-INF/services
A         fop-sandbox/src/main/resources/META-INF/services/org.apache.fop.render.intermediate.IFDocumentHandler
A         fop-sandbox/src/main/resources/META-INF/services/org.apache.fop.render.ImageHandler
A         fop-sandbox/src/main/resources/META-INF/services/org.apache.fop.fo.ElementMapping
A         fop-sandbox/src/main/resources/META-INF/services/org.apache.fop.render.XMLHandler
A         fop-sandbox/src/main/resources/META-INF/services/org.apache.fop.fo.FOEventHandler
A         fop-sandbox/src/tools
A         fop-sandbox/src/tools/resources
A         fop-sandbox/src/tools/resources/findbugs
AU        fop-sandbox/src/tools/resources/findbugs/exclusions.xml
A         fop-sandbox/src/test
A         fop-sandbox/src/test/java
A         fop-sandbox/src/test/resources
A         fop-servlet
AU        fop-servlet/pom.xml
A         fop-servlet/src
A         fop-servlet/src/main
A         fop-servlet/src/main/webapp
A         fop-servlet/src/main/webapp/WEB-INF
AU        fop-servlet/src/main/webapp/WEB-INF/web.xml
A         fop-servlet/src/tools
A         fop-servlet/src/tools/resources
A         fop-servlet/src/tools/resources/assembly
AU        fop-servlet/src/tools/resources/assembly/assembly.xml
A         fop-util
AU        fop-util/pom.xml
A         fop-util/src
A         fop-util/src/main
A         fop-util/src/main/java
A         fop-util/src/main/java/org
A         fop-util/src/main/java/org/apache
A         fop-util/src/main/java/org/apache/fop
A         fop-util/src/main/java/org/apache/fop/util
A         fop-util/src/main/java/org/apache/fop/util/text
AU        fop-util/src/main/java/org/apache/fop/util/text/AdvancedMessageFormat.java
AU        fop-util/src/main/java/org/apache/fop/util/DefaultErrorListener.java
AU        fop-util/src/main/java/org/apache/fop/util/XMLResourceBundle.java
AU        NOTICE
AU        README
AU        KEYS
AU        LICENSE
 U        .
At revision 1875643

No JDK named ?JDK 1.8.0_144 (unlimited security)? found
No JDK named ?JDK 1.8.0_144 (unlimited security)? found
Parsing POMs
Established TCP socket on 44181
maven33-agent.jar already up to date
maven33-interceptor.jar already up to date
maven3-interceptor-commons.jar already up to date
[xmlgraphics-fop] $ java -Xmx4g -Xms4g -cp /home/jenkins/jenkins-slave/maven33-agent.jar:/home/jenkins/tools/maven/apache-maven-3.3.9/boot/plexus-classworlds-2.5.2.jar:/home/jenkins/tools/maven/apache-maven-3.3.9/conf/logging jenkins.maven3.agent.Maven33Main /home/jenkins/tools/maven/apache-maven-3.3.9 /home/jenkins/jenkins-slave/remoting.jar /home/jenkins/jenkins-slave/maven33-interceptor.jar /home/jenkins/jenkins-slave/maven3-interceptor-commons.jar 44181
<===[JENKINS REMOTING CAPACITY]===>   channel started
Executing Maven:  -B -f <https://builds.apache.org/job/xmlgraphics-fop/ws/pom.xml> -Dmaven.repo.local=/home/jenkins/jenkins-slave/maven-repositories/1 clean install checkstyle:checkstyle findbugs:findbugs -B -U -e -fae -V -Djdk.path=/home/jenkins/tools/java/jdk1.7.0_79-unlimited-security
Apache Maven 3.3.9 (bb52d8502b132ec0a5a3f4c09453c07478323dc5; 2015-11-10T16:41:47+00:00)
Maven home: /usr/local/asfpackages/maven/apache-maven-3.3.9
Java version: 11.0.6, vendor: Ubuntu
Java home: /usr/lib/jvm/java-11-openjdk-amd64
Default locale: en_US, platform encoding: ISO-8859-1
OS name: "linux", version: "4.15.0-76-generic", arch: "amd64", family: "unix"
[INFO] Error stacktraces are turned on.
[INFO] Scanning for projects...
[INFO] ------------------------------------------------------------------------
[INFO] Reactor Build Order:
[INFO]
[INFO] Apache FOP Parent
[INFO] Apache FOP Utilities
[INFO] Apache FOP Events
[INFO] Apache FOP Core
[INFO] Apache FOP All-In-One
[INFO] Apache FOP Sandbox
[INFO] Apache FOP Servlet
[INFO] Apache FOP Transcoder
[INFO] Apache FOP Transcoder All-In-One
[INFO] Downloading: https://repo.maven.apache.org/maven2/org/apache/maven/plugins/maven-javadoc-plugin/maven-metadata.xml
[INFO] Downloaded: https://repo.maven.apache.org/maven2/org/apache/maven/plugins/maven-javadoc-plugin/maven-metadata.xml (2 KB at 1.2 KB/sec)
[INFO] Downloading: https://repo.maven.apache.org/maven2/org/apache/maven/plugins/maven-javadoc-plugin/3.2.0/maven-javadoc-plugin-3.2.0.pom
[INFO] Downloaded: https://repo.maven.apache.org/maven2/org/apache/maven/plugins/maven-javadoc-plugin/3.2.0/maven-javadoc-plugin-3.2.0.pom (20 KB at 732.6 KB/sec)
[INFO] Downloading: https://repo.maven.apache.org/maven2/org/apache/maven/plugins/maven-plugins/34/maven-plugins-34.pom
[INFO] Downloaded: https://repo.maven.apache.org/maven2/org/apache/maven/plugins/maven-plugins/34/maven-plugins-34.pom (11 KB at 474.4 KB/sec)
[INFO] Downloading: https://repo.maven.apache.org/maven2/org/apache/maven/maven-parent/34/maven-parent-34.pom
[INFO] Downloaded: https://repo.maven.apache.org/maven2/org/apache/maven/maven-parent/34/maven-parent-34.pom (42 KB at 1307.3 KB/sec)
[INFO] Downloading: https://repo.maven.apache.org/maven2/org/apache/maven/plugins/maven-javadoc-plugin/3.2.0/maven-javadoc-plugin-3.2.0.jar
[INFO] Downloaded: https://repo.maven.apache.org/maven2/org/apache/maven/plugins/maven-javadoc-plugin/3.2.0/maven-javadoc-plugin-3.2.0.jar (481 KB at 6963.7 KB/sec)
[INFO] Downloading: https://repo.maven.apache.org/maven2/org/apache/maven/plugins/maven-metadata.xml
[INFO] Downloading: https://repo.maven.apache.org/maven2/org/codehaus/mojo/maven-metadata.xml
[INFO] Downloaded: https://repo.maven.apache.org/maven2/org/apache/maven/plugins/maven-metadata.xml (14 KB at 349.8 KB/sec)
[INFO] Downloaded: https://repo.maven.apache.org/maven2/org/codehaus/mojo/maven-metadata.xml (20 KB at 312.4 KB/sec)
[INFO] Downloading: https://repo.maven.apache.org/maven2/org/codehaus/mojo/findbugs-maven-plugin/maven-metadata.xml
[INFO] Downloaded: https://repo.maven.apache.org/maven2/org/codehaus/mojo/findbugs-maven-plugin/maven-metadata.xml (2 KB at 25.2 KB/sec)
[INFO]                                                                        
[INFO] ------------------------------------------------------------------------
[INFO] Building Apache FOP Parent 2.5.0-SNAPSHOT
[INFO] ------------------------------------------------------------------------
[INFO]
[INFO] --- maven-clean-plugin:2.5:clean (default-clean) @ fop-parent ---
[INFO]
[INFO] --- maven-install-plugin:2.4:install (default-install) @ fop-parent ---
[INFO] Installing <https://builds.apache.org/job/xmlgraphics-fop/ws/pom.xml> to /home/jenkins/jenkins-slave/maven-repositories/1/org/apache/xmlgraphics/fop-parent/2.5.0-SNAPSHOT/fop-parent-2.5.0-SNAPSHOT.pom
[INFO]
[INFO] --- maven-checkstyle-plugin:2.14:checkstyle (default-cli) @ fop-parent ---
[WARNING] Attempt to (de-)serialize anonymous class hudson.plugins.analysis.core.HealthAwareReporter$2; see: https://jenkins.io/redirect/serialization-of-anonymous-classes/
[WARNING] Attempt to (de-)serialize anonymous class hudson.plugins.analysis.core.HealthAwareReporter$3; see: https://jenkins.io/redirect/serialization-of-anonymous-classes/
[CHECKSTYLE] No report found for mojo checkstyle
[INFO]
[INFO] --- findbugs-maven-plugin:3.0.5:findbugs (default-cli) @ fop-parent ---
WARNING: An illegal reflective access operation has occurred
WARNING: Illegal reflective access by org.codehaus.groovy.reflection.CachedClass (file:/home/jenkins/jenkins-slave/maven-repositories/1/org/codehaus/groovy/groovy/2.4.12/groovy-2.4.12.jar) to method java.lang.Object.finalize()
WARNING: Please consider reporting this to the maintainers of org.codehaus.groovy.reflection.CachedClass
WARNING: Use --illegal-access=warn to enable warnings of further illegal reflective access operations
WARNING: All illegal access operations will be denied in a future release
[FINDBUGS] No report found for mojo findbugs
[INFO]                                                                        
[INFO] ------------------------------------------------------------------------
[INFO] Building Apache FOP Utilities 2.5.0-SNAPSHOT
[INFO] ------------------------------------------------------------------------
[INFO] Downloading: https://repository.jboss.org/nexus/content/repositories/thirdparty-releases/org/apache/xmlgraphics/xmlgraphics-commons/2.4.0-SNAPSHOT/maven-metadata.xml
[INFO] Downloading: https://repository.apache.org/content/repositories/snapshots/org/apache/xmlgraphics/xmlgraphics-commons/2.4.0-SNAPSHOT/maven-metadata.xml
[INFO] Downloaded: https://repository.apache.org/content/repositories/snapshots/org/apache/xmlgraphics/xmlgraphics-commons/2.4.0-SNAPSHOT/maven-metadata.xml (794 B at 1.2 KB/sec)
[INFO]
[INFO] --- maven-clean-plugin:2.5:clean (default-clean) @ fop-util ---
[INFO]
[INFO] --- maven-resources-plugin:2.6:resources (default-resources) @ fop-util ---
[INFO] Using 'UTF-8' encoding to copy filtered resources.
[INFO] skip non existing resourceDirectory <https://builds.apache.org/job/xmlgraphics-fop/ws/fop-util/src/main/resources>
[INFO] Copying 2 resources to META-INF
[INFO]
[INFO] --- maven-compiler-plugin:3.1:compile (default-compile) @ fop-util ---
[INFO] Changes detected - recompiling the module!
[INFO] Compiling 3 source files to <https://builds.apache.org/job/xmlgraphics-fop/ws/fop-util/target/classes>
[INFO]                                                                        
[INFO] ------------------------------------------------------------------------
[INFO] Skipping Apache FOP Events
[INFO] This project has been banned from the build due to previous failures.
[INFO] ------------------------------------------------------------------------
[INFO]                                                                        
[INFO] ------------------------------------------------------------------------
[INFO] Skipping Apache FOP Core
[INFO] This project has been banned from the build due to previous failures.
[INFO] ------------------------------------------------------------------------
[INFO]                                                                        
[INFO] ------------------------------------------------------------------------
[INFO] Skipping Apache FOP All-In-One
[INFO] This project has been banned from the build due to previous failures.
[INFO] ------------------------------------------------------------------------
[INFO]                                                                        
[INFO] ------------------------------------------------------------------------
[INFO] Skipping Apache FOP Sandbox
[INFO] This project has been banned from the build due to previous failures.
[INFO] ------------------------------------------------------------------------
[INFO]                                                                        
[INFO] ------------------------------------------------------------------------
[INFO] Skipping Apache FOP Servlet
[INFO] This project has been banned from the build due to previous failures.
[INFO] ------------------------------------------------------------------------
[INFO]                                                                        
[INFO] ------------------------------------------------------------------------
[INFO] Skipping Apache FOP Transcoder
[INFO] This project has been banned from the build due to previous failures.
[INFO] ------------------------------------------------------------------------
[INFO]                                                                        
[INFO] ------------------------------------------------------------------------
[INFO] Skipping Apache FOP Transcoder All-In-One
[INFO] This project has been banned from the build due to previous failures.
[INFO] ------------------------------------------------------------------------
[INFO] ------------------------------------------------------------------------
[INFO] Reactor Summary:
[INFO]
[INFO] Apache FOP Parent .................................. SUCCESS [ 30.703 s]
[INFO] Apache FOP Utilities ............................... FAILURE [  2.726 s]
[INFO] Apache FOP Events .................................. SKIPPED
[INFO] Apache FOP Core .................................... SKIPPED
[INFO] Apache FOP All-In-One .............................. SKIPPED
[INFO] Apache FOP Sandbox ................................. SKIPPED
[INFO] Apache FOP Servlet ................................. SKIPPED
[INFO] Apache FOP Transcoder .............................. SKIPPED
[INFO] Apache FOP Transcoder All-In-One ................... SKIPPED
[INFO] ------------------------------------------------------------------------
[INFO] BUILD FAILURE
[INFO] ------------------------------------------------------------------------
[INFO] Total time: 51.574 s
[INFO] Finished at: 2020-03-25T14:38:16+00:00
[INFO] Final Memory: 40M/4096M
[INFO] ------------------------------------------------------------------------
Waiting for Jenkins to finish collecting data
[ERROR] Failed to execute goal org.apache.maven.plugins:maven-compiler-plugin:3.1:compile (default-compile) on project fop-util: Compilation failure -> [Help 1]
org.apache.maven.lifecycle.LifecycleExecutionException: Failed to execute goal org.apache.maven.plugins:maven-compiler-plugin:3.1:compile (default-compile) on project fop-util: Compilation failure
        at org.apache.maven.lifecycle.internal.MojoExecutor.execute(MojoExecutor.java:212)
        at org.apache.maven.lifecycle.internal.MojoExecutor.execute(MojoExecutor.java:153)
        at org.apache.maven.lifecycle.internal.MojoExecutor.execute(MojoExecutor.java:145)
        at org.apache.maven.lifecycle.internal.LifecycleModuleBuilder.buildProject(LifecycleModuleBuilder.java:116)
        at org.apache.maven.lifecycle.internal.LifecycleModuleBuilder.buildProject(LifecycleModuleBuilder.java:80)
        at org.apache.maven.lifecycle.internal.builder.singlethreaded.SingleThreadedBuilder.build(SingleThreadedBuilder.java:51)
        at org.apache.maven.lifecycle.internal.LifecycleStarter.execute(LifecycleStarter.java:128)
        at org.apache.maven.DefaultMaven.doExecute(DefaultMaven.java:307)
        at org.apache.maven.DefaultMaven.doExecute(DefaultMaven.java:193)
        at org.apache.maven.DefaultMaven.execute(DefaultMaven.java:106)
        at org.jvnet.hudson.maven3.launcher.Maven33Launcher.main(Maven33Launcher.java:129)
        at java.base/jdk.internal.reflect.NativeMethodAccessorImpl.invoke0(Native Method)
        at java.base/jdk.internal.reflect.NativeMethodAccessorImpl.invoke(NativeMethodAccessorImpl.java:62)
        at java.base/jdk.internal.reflect.DelegatingMethodAccessorImpl.invoke(DelegatingMethodAccessorImpl.java:43)
        at java.base/java.lang.reflect.Method.invoke(Method.java:566)
        at org.codehaus.plexus.classworlds.launcher.Launcher.launchStandard(Launcher.java:330)
        at org.codehaus.plexus.classworlds.launcher.Launcher.launch(Launcher.java:238)
        at jenkins.maven3.agent.Maven33Main.launch(Maven33Main.java:178)
        at java.base/jdk.internal.reflect.NativeMethodAccessorImpl.invoke0(Native Method)
        at java.base/jdk.internal.reflect.NativeMethodAccessorImpl.invoke(NativeMethodAccessorImpl.java:62)
        at java.base/jdk.internal.reflect.DelegatingMethodAccessorImpl.invoke(DelegatingMethodAccessorImpl.java:43)
        at java.base/java.lang.reflect.Method.invoke(Method.java:566)
        at hudson.maven.Maven3Builder.call(Maven3Builder.java:139)
        at hudson.maven.Maven3Builder.call(Maven3Builder.java:70)
        at hudson.remoting.UserRequest.perform(UserRequest.java:212)
        at hudson.remoting.UserRequest.perform(UserRequest.java:54)
        at hudson.remoting.Request$2.run(Request.java:369)
        at hudson.remoting.InterceptingExecutorService$1.call(InterceptingExecutorService.java:72)
        at java.base/java.util.concurrent.FutureTask.run(FutureTask.java:264)
        at java.base/java.util.concurrent.ThreadPoolExecutor.runWorker(ThreadPoolExecutor.java:1128)
        at java.base/java.util.concurrent.ThreadPoolExecutor$Worker.run(ThreadPoolExecutor.java:628)
        at java.base/java.lang.Thread.run(Thread.java:834)
Caused by: org.apache.maven.plugin.compiler.CompilationFailureException: Compilation failure
        at org.apache.maven.plugin.compiler.AbstractCompilerMojo.execute(AbstractCompilerMojo.java:862)
        at org.apache.maven.plugin.compiler.CompilerMojo.execute(CompilerMojo.java:129)
        at org.apache.maven.plugin.DefaultBuildPluginManager.executeMojo(DefaultBuildPluginManager.java:134)
        at org.apache.maven.lifecycle.internal.MojoExecutor.execute(MojoExecutor.java:207)
        ... 31 more
[ERROR]
[ERROR] Re-run Maven using the -X switch to enable full debug logging.
[ERROR]
[ERROR] For more information about the errors and possible solutions, please read the following articles:
[ERROR] [Help 1] http://cwiki.apache.org/confluence/display/MAVEN/MojoFailureException
[ERROR]
[ERROR] After correcting the problems, you can resume the build with the command
[ERROR]   mvn <goals> -rf :fop-util
[JENKINS] Archiving <https://builds.apache.org/job/xmlgraphics-fop/ws/fop-sandbox/pom.xml> to org.apache.xmlgraphics/fop-sandbox/2.5.0-SNAPSHOT/fop-sandbox-2.5.0-SNAPSHOT.pom
[JENKINS] Archiving <https://builds.apache.org/job/xmlgraphics-fop/ws/pom.xml> to org.apache.xmlgraphics/fop-parent/2.5.0-SNAPSHOT/fop-parent-2.5.0-SNAPSHOT.pom
[JENKINS] Archiving <https://builds.apache.org/job/xmlgraphics-fop/ws/fop-core/pom.xml> to org.apache.xmlgraphics/fop-core/2.5.0-SNAPSHOT/fop-core-2.5.0-SNAPSHOT.pom
[JENKINS] Archiving <https://builds.apache.org/job/xmlgraphics-fop/ws/fop/pom.xml> to org.apache.xmlgraphics/fop/2.5.0-SNAPSHOT/fop-2.5.0-SNAPSHOT.pom
[JENKINS] Archiving <https://builds.apache.org/job/xmlgraphics-fop/ws/fop-servlet/pom.xml> to org.apache.xmlgraphics/fop-servlet/2.5.0-SNAPSHOT/fop-servlet-2.5.0-SNAPSHOT.pom
[JENKINS] Archiving <https://builds.apache.org/job/xmlgraphics-fop/ws/fop-transcoder-allinone/pom.xml> to org.apache.xmlgraphics/fop-transcoder-allinone/2.5.0-SNAPSHOT/fop-transcoder-allinone-2.5.0-SNAPSHOT.pom
[JENKINS] Archiving <https://builds.apache.org/job/xmlgraphics-fop/ws/fop-util/pom.xml> to org.apache.xmlgraphics/fop-util/2.5.0-SNAPSHOT/fop-util-2.5.0-SNAPSHOT.pom
[JENKINS] Archiving <https://builds.apache.org/job/xmlgraphics-fop/ws/fop-events/pom.xml> to org.apache.xmlgraphics/fop-events/2.5.0-SNAPSHOT/fop-events-2.5.0-SNAPSHOT.pom
[JENKINS] Archiving <https://builds.apache.org/job/xmlgraphics-fop/ws/fop-transcoder/pom.xml> to org.apache.xmlgraphics/fop-transcoder/2.5.0-SNAPSHOT/fop-transcoder-2.5.0-SNAPSHOT.pom
channel stopped
No JDK named ?JDK 1.8.0_144 (unlimited security)? found
No JDK named ?JDK 1.8.0_144 (unlimited security)? found
No JDK named ?JDK 1.8.0_144 (unlimited security)? found
Reply | Threaded
Open this post in threaded view
|

Build failed in Jenkins: xmlgraphics-fop #287

Apache Jenkins Server
See <https://builds.apache.org/job/xmlgraphics-fop/287/display/redirect?page=changes>

Changes:

[ssteiner] FOP-2925: Change in IPD on empty block NPE


------------------------------------------
Started by an SCM change
Running as SYSTEM
No JDK named ?JDK 1.8.0_144 (unlimited security)? found
No JDK named ?JDK 1.8.0_144 (unlimited security)? found
[EnvInject] - Loading node environment variables.
No JDK named ?JDK 1.8.0_144 (unlimited security)? found
Building remotely on H48 (ubuntu) in workspace <https://builds.apache.org/job/xmlgraphics-fop/ws/>
No JDK named ?JDK 1.8.0_144 (unlimited security)? found
Updating https://svn.apache.org/repos/asf/xmlgraphics/fop/trunk at revision '2020-03-25T14:48:11.456 +0000'
AU        fop/test/layoutengine/standard-testcases/flow_changing-ipd_last-page_15.xml
U         fop-core/src/main/java/org/apache/fop/fo/FObj.java
U         fop-core/src/main/java/org/apache/fop/layoutmgr/AbstractBreaker.java
U         fop-core/src/main/java/org/apache/fop/layoutmgr/BlockStackingLayoutManager.java
AU        fop-core/src/main/java/org/apache/fop/layoutmgr/RestartAtLM.java
At revision 1875645

No JDK named ?JDK 1.8.0_144 (unlimited security)? found
No JDK named ?JDK 1.8.0_144 (unlimited security)? found
Parsing POMs
Established TCP socket on 42817
maven33-agent.jar already up to date
maven33-interceptor.jar already up to date
maven3-interceptor-commons.jar already up to date
[xmlgraphics-fop] $ java -Xmx4g -Xms4g -cp /home/jenkins/jenkins-slave/maven33-agent.jar:/home/jenkins/tools/maven/apache-maven-3.3.9/boot/plexus-classworlds-2.5.2.jar:/home/jenkins/tools/maven/apache-maven-3.3.9/conf/logging jenkins.maven3.agent.Maven33Main /home/jenkins/tools/maven/apache-maven-3.3.9 /home/jenkins/jenkins-slave/remoting.jar /home/jenkins/jenkins-slave/maven33-interceptor.jar /home/jenkins/jenkins-slave/maven3-interceptor-commons.jar 42817
<===[JENKINS REMOTING CAPACITY]===>   channel started
Executing Maven:  -B -f <https://builds.apache.org/job/xmlgraphics-fop/ws/pom.xml> -Dmaven.repo.local=/home/jenkins/jenkins-slave/maven-repositories/1 clean install checkstyle:checkstyle findbugs:findbugs -B -U -e -fae -V -Djdk.path=/home/jenkins/tools/java/jdk1.7.0_79-unlimited-security
Apache Maven 3.3.9 (bb52d8502b132ec0a5a3f4c09453c07478323dc5; 2015-11-10T16:41:47+00:00)
Maven home: /usr/local/asfpackages/maven/apache-maven-3.3.9
Java version: 11.0.6, vendor: Ubuntu
Java home: /usr/lib/jvm/java-11-openjdk-amd64
Default locale: en_US, platform encoding: ISO-8859-1
OS name: "linux", version: "4.15.0-76-generic", arch: "amd64", family: "unix"
[INFO] Error stacktraces are turned on.
[INFO] Scanning for projects...
[INFO] ------------------------------------------------------------------------
[INFO] Reactor Build Order:
[INFO]
[INFO] Apache FOP Parent
[INFO] Apache FOP Utilities
[INFO] Apache FOP Events
[INFO] Apache FOP Core
[INFO] Apache FOP All-In-One
[INFO] Apache FOP Sandbox
[INFO] Apache FOP Servlet
[INFO] Apache FOP Transcoder
[INFO] Apache FOP Transcoder All-In-One
[INFO] Downloading: https://repo.maven.apache.org/maven2/org/apache/maven/plugins/maven-javadoc-plugin/maven-metadata.xml
[INFO] Downloaded: https://repo.maven.apache.org/maven2/org/apache/maven/plugins/maven-javadoc-plugin/maven-metadata.xml (2 KB at 1.2 KB/sec)
[INFO] Downloading: https://repo.maven.apache.org/maven2/org/apache/maven/plugins/maven-metadata.xml
[INFO] Downloading: https://repo.maven.apache.org/maven2/org/codehaus/mojo/maven-metadata.xml
[INFO] Downloaded: https://repo.maven.apache.org/maven2/org/apache/maven/plugins/maven-metadata.xml (14 KB at 64.5 KB/sec)
[INFO] Downloaded: https://repo.maven.apache.org/maven2/org/codehaus/mojo/maven-metadata.xml (20 KB at 94.7 KB/sec)
[INFO] Downloading: https://repo.maven.apache.org/maven2/org/codehaus/mojo/findbugs-maven-plugin/maven-metadata.xml
[INFO] Downloaded: https://repo.maven.apache.org/maven2/org/codehaus/mojo/findbugs-maven-plugin/maven-metadata.xml (2 KB at 11.0 KB/sec)
[INFO]                                                                        
[INFO] ------------------------------------------------------------------------
[INFO] Building Apache FOP Parent 2.5.0-SNAPSHOT
[INFO] ------------------------------------------------------------------------
[INFO]
[INFO] --- maven-clean-plugin:2.5:clean (default-clean) @ fop-parent ---
[INFO] Deleting <https://builds.apache.org/job/xmlgraphics-fop/ws/target>
[INFO]
[INFO] --- maven-install-plugin:2.4:install (default-install) @ fop-parent ---
[INFO] Installing <https://builds.apache.org/job/xmlgraphics-fop/ws/pom.xml> to /home/jenkins/jenkins-slave/maven-repositories/1/org/apache/xmlgraphics/fop-parent/2.5.0-SNAPSHOT/fop-parent-2.5.0-SNAPSHOT.pom
[INFO]
[INFO] --- maven-checkstyle-plugin:2.14:checkstyle (default-cli) @ fop-parent ---
[WARNING] Attempt to (de-)serialize anonymous class hudson.plugins.analysis.core.HealthAwareReporter$2; see: https://jenkins.io/redirect/serialization-of-anonymous-classes/
[WARNING] Attempt to (de-)serialize anonymous class hudson.plugins.analysis.core.HealthAwareReporter$3; see: https://jenkins.io/redirect/serialization-of-anonymous-classes/
[CHECKSTYLE] No report found for mojo checkstyle
[INFO]
[INFO] --- findbugs-maven-plugin:3.0.5:findbugs (default-cli) @ fop-parent ---
WARNING: An illegal reflective access operation has occurred
WARNING: Illegal reflective access by org.codehaus.groovy.reflection.CachedClass (file:/home/jenkins/jenkins-slave/maven-repositories/1/org/codehaus/groovy/groovy/2.4.12/groovy-2.4.12.jar) to method java.lang.Object.finalize()
WARNING: Please consider reporting this to the maintainers of org.codehaus.groovy.reflection.CachedClass
WARNING: Use --illegal-access=warn to enable warnings of further illegal reflective access operations
WARNING: All illegal access operations will be denied in a future release
[FINDBUGS] No report found for mojo findbugs
[INFO]                                                                        
[INFO] ------------------------------------------------------------------------
[INFO] Building Apache FOP Utilities 2.5.0-SNAPSHOT
[INFO] ------------------------------------------------------------------------
[INFO] Downloading: https://repository.apache.org/content/repositories/snapshots/org/apache/xmlgraphics/xmlgraphics-commons/2.4.0-SNAPSHOT/maven-metadata.xml
[INFO] Downloading: https://repository.jboss.org/nexus/content/repositories/thirdparty-releases/org/apache/xmlgraphics/xmlgraphics-commons/2.4.0-SNAPSHOT/maven-metadata.xml
[INFO] Downloaded: https://repository.apache.org/content/repositories/snapshots/org/apache/xmlgraphics/xmlgraphics-commons/2.4.0-SNAPSHOT/maven-metadata.xml (794 B at 0.9 KB/sec)
[INFO]
[INFO] --- maven-clean-plugin:2.5:clean (default-clean) @ fop-util ---
[INFO] Deleting <https://builds.apache.org/job/xmlgraphics-fop/ws/fop-util/target>
[INFO]
[INFO] --- maven-resources-plugin:2.6:resources (default-resources) @ fop-util ---
[INFO] Using 'UTF-8' encoding to copy filtered resources.
[INFO] skip non existing resourceDirectory <https://builds.apache.org/job/xmlgraphics-fop/ws/fop-util/src/main/resources>
[INFO] Copying 2 resources to META-INF
[INFO]
[INFO] --- maven-compiler-plugin:3.1:compile (default-compile) @ fop-util ---
[INFO] Changes detected - recompiling the module!
[INFO] Compiling 3 source files to <https://builds.apache.org/job/xmlgraphics-fop/ws/fop-util/target/classes>
[INFO]                                                                        
[INFO] ------------------------------------------------------------------------
[INFO] Skipping Apache FOP Events
[INFO] This project has been banned from the build due to previous failures.
[INFO] ------------------------------------------------------------------------
[INFO]                                                                        
[INFO] ------------------------------------------------------------------------
[INFO] Skipping Apache FOP Core
[INFO] This project has been banned from the build due to previous failures.
[INFO] ------------------------------------------------------------------------
[INFO]                                                                        
[INFO] ------------------------------------------------------------------------
[INFO] Skipping Apache FOP All-In-One
[INFO] This project has been banned from the build due to previous failures.
[INFO] ------------------------------------------------------------------------
[INFO]                                                                        
[INFO] ------------------------------------------------------------------------
[INFO] Skipping Apache FOP Sandbox
[INFO] This project has been banned from the build due to previous failures.
[INFO] ------------------------------------------------------------------------
[INFO]                                                                        
[INFO] ------------------------------------------------------------------------
[INFO] Skipping Apache FOP Servlet
[INFO] This project has been banned from the build due to previous failures.
[INFO] ------------------------------------------------------------------------
[INFO]                                                                        
[INFO] ------------------------------------------------------------------------
[INFO] Skipping Apache FOP Transcoder
[INFO] This project has been banned from the build due to previous failures.
[INFO] ------------------------------------------------------------------------
[INFO]                                                                        
[INFO] ------------------------------------------------------------------------
[INFO] Skipping Apache FOP Transcoder All-In-One
[INFO] This project has been banned from the build due to previous failures.
[INFO] ------------------------------------------------------------------------
[INFO] ------------------------------------------------------------------------
[INFO] Reactor Summary:
[INFO]
[INFO] Apache FOP Parent .................................. SUCCESS [ 22.622 s]
[INFO] Apache FOP Utilities ............................... FAILURE [  3.086 s]
[INFO] Apache FOP Events .................................. SKIPPED
[INFO] Apache FOP Core .................................... SKIPPED
[INFO] Apache FOP All-In-One .............................. SKIPPED
[INFO] Apache FOP Sandbox ................................. SKIPPED
[INFO] Apache FOP Servlet ................................. SKIPPED
[INFO] Apache FOP Transcoder .............................. SKIPPED
[INFO] Apache FOP Transcoder All-In-One ................... SKIPPED
[INFO] ------------------------------------------------------------------------
[INFO] BUILD FAILURE
[INFO] ------------------------------------------------------------------------
[INFO] Total time: 46.033 s
[INFO] Finished at: 2020-03-25T14:49:42+00:00
[INFO] Final Memory: 39M/4096M
[INFO] ------------------------------------------------------------------------
Waiting for Jenkins to finish collecting data
[ERROR] Failed to execute goal org.apache.maven.plugins:maven-compiler-plugin:3.1:compile (default-compile) on project fop-util: Compilation failure -> [Help 1]
org.apache.maven.lifecycle.LifecycleExecutionException: Failed to execute goal org.apache.maven.plugins:maven-compiler-plugin:3.1:compile (default-compile) on project fop-util: Compilation failure
        at org.apache.maven.lifecycle.internal.MojoExecutor.execute(MojoExecutor.java:212)
        at org.apache.maven.lifecycle.internal.MojoExecutor.execute(MojoExecutor.java:153)
        at org.apache.maven.lifecycle.internal.MojoExecutor.execute(MojoExecutor.java:145)
        at org.apache.maven.lifecycle.internal.LifecycleModuleBuilder.buildProject(LifecycleModuleBuilder.java:116)
        at org.apache.maven.lifecycle.internal.LifecycleModuleBuilder.buildProject(LifecycleModuleBuilder.java:80)
        at org.apache.maven.lifecycle.internal.builder.singlethreaded.SingleThreadedBuilder.build(SingleThreadedBuilder.java:51)
        at org.apache.maven.lifecycle.internal.LifecycleStarter.execute(LifecycleStarter.java:128)
        at org.apache.maven.DefaultMaven.doExecute(DefaultMaven.java:307)
        at org.apache.maven.DefaultMaven.doExecute(DefaultMaven.java:193)
        at org.apache.maven.DefaultMaven.execute(DefaultMaven.java:106)
        at org.jvnet.hudson.maven3.launcher.Maven33Launcher.main(Maven33Launcher.java:129)
        at java.base/jdk.internal.reflect.NativeMethodAccessorImpl.invoke0(Native Method)
        at java.base/jdk.internal.reflect.NativeMethodAccessorImpl.invoke(NativeMethodAccessorImpl.java:62)
        at java.base/jdk.internal.reflect.DelegatingMethodAccessorImpl.invoke(DelegatingMethodAccessorImpl.java:43)
        at java.base/java.lang.reflect.Method.invoke(Method.java:566)
        at org.codehaus.plexus.classworlds.launcher.Launcher.launchStandard(Launcher.java:330)
        at org.codehaus.plexus.classworlds.launcher.Launcher.launch(Launcher.java:238)
        at jenkins.maven3.agent.Maven33Main.launch(Maven33Main.java:178)
        at java.base/jdk.internal.reflect.NativeMethodAccessorImpl.invoke0(Native Method)
        at java.base/jdk.internal.reflect.NativeMethodAccessorImpl.invoke(NativeMethodAccessorImpl.java:62)
        at java.base/jdk.internal.reflect.DelegatingMethodAccessorImpl.invoke(DelegatingMethodAccessorImpl.java:43)
        at java.base/java.lang.reflect.Method.invoke(Method.java:566)
        at hudson.maven.Maven3Builder.call(Maven3Builder.java:139)
        at hudson.maven.Maven3Builder.call(Maven3Builder.java:70)
        at hudson.remoting.UserRequest.perform(UserRequest.java:212)
        at hudson.remoting.UserRequest.perform(UserRequest.java:54)
        at hudson.remoting.Request$2.run(Request.java:369)
        at hudson.remoting.InterceptingExecutorService$1.call(InterceptingExecutorService.java:72)
        at java.base/java.util.concurrent.FutureTask.run(FutureTask.java:264)
        at java.base/java.util.concurrent.ThreadPoolExecutor.runWorker(ThreadPoolExecutor.java:1128)
        at java.base/java.util.concurrent.ThreadPoolExecutor$Worker.run(ThreadPoolExecutor.java:628)
        at java.base/java.lang.Thread.run(Thread.java:834)
Caused by: org.apache.maven.plugin.compiler.CompilationFailureException: Compilation failure
        at org.apache.maven.plugin.compiler.AbstractCompilerMojo.execute(AbstractCompilerMojo.java:862)
        at org.apache.maven.plugin.compiler.CompilerMojo.execute(CompilerMojo.java:129)
        at org.apache.maven.plugin.DefaultBuildPluginManager.executeMojo(DefaultBuildPluginManager.java:134)
        at org.apache.maven.lifecycle.internal.MojoExecutor.execute(MojoExecutor.java:207)
        ... 31 more
[ERROR]
[ERROR] Re-run Maven using the -X switch to enable full debug logging.
[ERROR]
[ERROR] For more information about the errors and possible solutions, please read the following articles:
[ERROR] [Help 1] http://cwiki.apache.org/confluence/display/MAVEN/MojoFailureException
[ERROR]
[ERROR] After correcting the problems, you can resume the build with the command
[ERROR]   mvn <goals> -rf :fop-util
[JENKINS] Archiving <https://builds.apache.org/job/xmlgraphics-fop/ws/fop-sandbox/pom.xml> to org.apache.xmlgraphics/fop-sandbox/2.5.0-SNAPSHOT/fop-sandbox-2.5.0-SNAPSHOT.pom
[JENKINS] Archiving <https://builds.apache.org/job/xmlgraphics-fop/ws/pom.xml> to org.apache.xmlgraphics/fop-parent/2.5.0-SNAPSHOT/fop-parent-2.5.0-SNAPSHOT.pom
[JENKINS] Archiving <https://builds.apache.org/job/xmlgraphics-fop/ws/fop-core/pom.xml> to org.apache.xmlgraphics/fop-core/2.5.0-SNAPSHOT/fop-core-2.5.0-SNAPSHOT.pom
[JENKINS] Archiving <https://builds.apache.org/job/xmlgraphics-fop/ws/fop/pom.xml> to org.apache.xmlgraphics/fop/2.5.0-SNAPSHOT/fop-2.5.0-SNAPSHOT.pom
[JENKINS] Archiving <https://builds.apache.org/job/xmlgraphics-fop/ws/fop-servlet/pom.xml> to org.apache.xmlgraphics/fop-servlet/2.5.0-SNAPSHOT/fop-servlet-2.5.0-SNAPSHOT.pom
[JENKINS] Archiving <https://builds.apache.org/job/xmlgraphics-fop/ws/fop-transcoder-allinone/pom.xml> to org.apache.xmlgraphics/fop-transcoder-allinone/2.5.0-SNAPSHOT/fop-transcoder-allinone-2.5.0-SNAPSHOT.pom
[JENKINS] Archiving <https://builds.apache.org/job/xmlgraphics-fop/ws/fop-util/pom.xml> to org.apache.xmlgraphics/fop-util/2.5.0-SNAPSHOT/fop-util-2.5.0-SNAPSHOT.pom
[JENKINS] Archiving <https://builds.apache.org/job/xmlgraphics-fop/ws/fop-events/pom.xml> to org.apache.xmlgraphics/fop-events/2.5.0-SNAPSHOT/fop-events-2.5.0-SNAPSHOT.pom
[JENKINS] Archiving <https://builds.apache.org/job/xmlgraphics-fop/ws/fop-transcoder/pom.xml> to org.apache.xmlgraphics/fop-transcoder/2.5.0-SNAPSHOT/fop-transcoder-2.5.0-SNAPSHOT.pom
channel stopped
No JDK named ?JDK 1.8.0_144 (unlimited security)? found
No JDK named ?JDK 1.8.0_144 (unlimited security)? found
No JDK named ?JDK 1.8.0_144 (unlimited security)? found
Reply | Threaded
Open this post in threaded view
|

Build failed in Jenkins: xmlgraphics-fop #288

Apache Jenkins Server
See <https://builds.apache.org/job/xmlgraphics-fop/288/display/redirect>

Changes:


------------------------------------------
Started by user ssteiner
Running as SYSTEM
[EnvInject] - Loading node environment variables.
Building remotely on H48 (ubuntu) in workspace <https://builds.apache.org/job/xmlgraphics-fop/ws/>
Updating https://svn.apache.org/repos/asf/xmlgraphics/fop/trunk at revision '2020-03-25T14:50:39.731 +0000'
At revision 1875645

No changes for https://svn.apache.org/repos/asf/xmlgraphics/fop/trunk since the previous build
Parsing POMs
Established TCP socket on 34083
maven33-agent.jar already up to date
maven33-interceptor.jar already up to date
maven3-interceptor-commons.jar already up to date
[xmlgraphics-fop] $ /home/jenkins/tools/java/latest1.8/bin/java -Xmx4g -Xms4g -cp /home/jenkins/jenkins-slave/maven33-agent.jar:/home/jenkins/tools/maven/apache-maven-3.3.9/boot/plexus-classworlds-2.5.2.jar:/home/jenkins/tools/maven/apache-maven-3.3.9/conf/logging jenkins.maven3.agent.Maven33Main /home/jenkins/tools/maven/apache-maven-3.3.9 /home/jenkins/jenkins-slave/remoting.jar /home/jenkins/jenkins-slave/maven33-interceptor.jar /home/jenkins/jenkins-slave/maven3-interceptor-commons.jar 34083
<===[JENKINS REMOTING CAPACITY]===>   channel started
Executing Maven:  -B -f <https://builds.apache.org/job/xmlgraphics-fop/ws/pom.xml> -Dmaven.repo.local=/home/jenkins/jenkins-slave/maven-repositories/1 clean install checkstyle:checkstyle findbugs:findbugs -B -U -e -fae -V -Djdk.path=/home/jenkins/tools/java/jdk1.7.0_79-unlimited-security
Apache Maven 3.3.9 (bb52d8502b132ec0a5a3f4c09453c07478323dc5; 2015-11-10T16:41:47+00:00)
Maven home: /usr/local/asfpackages/maven/apache-maven-3.3.9
Java version: 1.8.0_241, vendor: Oracle Corporation
Java home: /usr/local/asfpackages/java/jdk1.8.0_241/jre
Default locale: en_US, platform encoding: ISO-8859-1
OS name: "linux", version: "4.15.0-76-generic", arch: "amd64", family: "unix"
[INFO] Error stacktraces are turned on.
[INFO] Scanning for projects...
[INFO] ------------------------------------------------------------------------
[INFO] Reactor Build Order:
[INFO]
[INFO] Apache FOP Parent
[INFO] Apache FOP Utilities
[INFO] Apache FOP Events
[INFO] Apache FOP Core
[INFO] Apache FOP All-In-One
[INFO] Apache FOP Sandbox
[INFO] Apache FOP Servlet
[INFO] Apache FOP Transcoder
[INFO] Apache FOP Transcoder All-In-One
[INFO] Downloading: https://repo.maven.apache.org/maven2/org/apache/maven/plugins/maven-javadoc-plugin/maven-metadata.xml
[INFO] Downloaded: https://repo.maven.apache.org/maven2/org/apache/maven/plugins/maven-javadoc-plugin/maven-metadata.xml (2 KB at 0.9 KB/sec)
[INFO] Downloading: https://repo.maven.apache.org/maven2/org/codehaus/mojo/maven-metadata.xml
[INFO] Downloading: https://repo.maven.apache.org/maven2/org/apache/maven/plugins/maven-metadata.xml
[INFO] Downloaded: https://repo.maven.apache.org/maven2/org/codehaus/mojo/maven-metadata.xml (20 KB at 59.3 KB/sec)
[INFO] Downloaded: https://repo.maven.apache.org/maven2/org/apache/maven/plugins/maven-metadata.xml (14 KB at 36.3 KB/sec)
[INFO] Downloading: https://repo.maven.apache.org/maven2/org/codehaus/mojo/findbugs-maven-plugin/maven-metadata.xml
[INFO] Downloaded: https://repo.maven.apache.org/maven2/org/codehaus/mojo/findbugs-maven-plugin/maven-metadata.xml (2 KB at 11.5 KB/sec)
[INFO]                                                                        
[INFO] ------------------------------------------------------------------------
[INFO] Building Apache FOP Parent 2.5.0-SNAPSHOT
[INFO] ------------------------------------------------------------------------
[INFO]
[INFO] --- maven-clean-plugin:2.5:clean (default-clean) @ fop-parent ---
[INFO] Deleting <https://builds.apache.org/job/xmlgraphics-fop/ws/target>
[INFO]
[INFO] --- maven-install-plugin:2.4:install (default-install) @ fop-parent ---
[INFO] Installing <https://builds.apache.org/job/xmlgraphics-fop/ws/pom.xml> to /home/jenkins/jenkins-slave/maven-repositories/1/org/apache/xmlgraphics/fop-parent/2.5.0-SNAPSHOT/fop-parent-2.5.0-SNAPSHOT.pom
[INFO]
[INFO] --- maven-checkstyle-plugin:2.14:checkstyle (default-cli) @ fop-parent ---
[WARNING] Attempt to (de-)serialize anonymous class hudson.plugins.analysis.core.HealthAwareReporter$2; see: https://jenkins.io/redirect/serialization-of-anonymous-classes/
[WARNING] Attempt to (de-)serialize anonymous class hudson.plugins.analysis.core.HealthAwareReporter$3; see: https://jenkins.io/redirect/serialization-of-anonymous-classes/
[CHECKSTYLE] No report found for mojo checkstyle
[INFO]
[INFO] --- findbugs-maven-plugin:3.0.5:findbugs (default-cli) @ fop-parent ---
[FINDBUGS] No report found for mojo findbugs
[INFO]                                                                        
[INFO] ------------------------------------------------------------------------
[INFO] Building Apache FOP Utilities 2.5.0-SNAPSHOT
[INFO] ------------------------------------------------------------------------
[INFO] Downloading: https://repository.apache.org/content/repositories/snapshots/org/apache/xmlgraphics/xmlgraphics-commons/2.4.0-SNAPSHOT/maven-metadata.xml
[INFO] Downloading: https://repository.jboss.org/nexus/content/repositories/thirdparty-releases/org/apache/xmlgraphics/xmlgraphics-commons/2.4.0-SNAPSHOT/maven-metadata.xml
[INFO] Downloaded: https://repository.apache.org/content/repositories/snapshots/org/apache/xmlgraphics/xmlgraphics-commons/2.4.0-SNAPSHOT/maven-metadata.xml (794 B at 0.9 KB/sec)
[INFO]
[INFO] --- maven-clean-plugin:2.5:clean (default-clean) @ fop-util ---
[INFO] Deleting <https://builds.apache.org/job/xmlgraphics-fop/ws/fop-util/target>
[INFO]
[INFO] --- maven-resources-plugin:2.6:resources (default-resources) @ fop-util ---
[INFO] Using 'UTF-8' encoding to copy filtered resources.
[INFO] skip non existing resourceDirectory <https://builds.apache.org/job/xmlgraphics-fop/ws/fop-util/src/main/resources>
[INFO] Copying 2 resources to META-INF
[INFO]
[INFO] --- maven-compiler-plugin:3.1:compile (default-compile) @ fop-util ---
[INFO] Changes detected - recompiling the module!
[INFO] Compiling 3 source files to <https://builds.apache.org/job/xmlgraphics-fop/ws/fop-util/target/classes>
[INFO]                                                                        
[INFO] ------------------------------------------------------------------------
[INFO] Skipping Apache FOP Events
[INFO] This project has been banned from the build due to previous failures.
[INFO] ------------------------------------------------------------------------
[INFO]                                                                        
[INFO] ------------------------------------------------------------------------
[INFO] Skipping Apache FOP Core
[INFO] This project has been banned from the build due to previous failures.
[INFO] ------------------------------------------------------------------------
[INFO]                                                                        
[INFO] ------------------------------------------------------------------------
[INFO] Skipping Apache FOP All-In-One
[INFO] This project has been banned from the build due to previous failures.
[INFO] ------------------------------------------------------------------------
[INFO]                                                                        
[INFO] ------------------------------------------------------------------------
[INFO] Skipping Apache FOP Sandbox
[INFO] This project has been banned from the build due to previous failures.
[INFO] ------------------------------------------------------------------------
[INFO]                                                                        
[INFO] ------------------------------------------------------------------------
[INFO] Skipping Apache FOP Servlet
[INFO] This project has been banned from the build due to previous failures.
[INFO] ------------------------------------------------------------------------
[INFO]                                                                        
[INFO] ------------------------------------------------------------------------
[INFO] Skipping Apache FOP Transcoder
[INFO] This project has been banned from the build due to previous failures.
[INFO] ------------------------------------------------------------------------
[INFO]                                                                        
[INFO] ------------------------------------------------------------------------
[INFO] Skipping Apache FOP Transcoder All-In-One
[INFO] This project has been banned from the build due to previous failures.
[INFO] ------------------------------------------------------------------------
[INFO] ------------------------------------------------------------------------
[INFO] Reactor Summary:
[INFO]
[INFO] Apache FOP Parent .................................. SUCCESS [ 17.386 s]
[INFO] Apache FOP Utilities ............................... FAILURE [  3.233 s]
[INFO] Apache FOP Events .................................. SKIPPED
[INFO] Apache FOP Core .................................... SKIPPED
[INFO] Apache FOP All-In-One .............................. SKIPPED
[INFO] Apache FOP Sandbox ................................. SKIPPED
[INFO] Apache FOP Servlet ................................. SKIPPED
[INFO] Apache FOP Transcoder .............................. SKIPPED
[INFO] Apache FOP Transcoder All-In-One ................... SKIPPED
[INFO] ------------------------------------------------------------------------
[INFO] BUILD FAILURE
[INFO] ------------------------------------------------------------------------
[INFO] Total time: 40.666 s
[INFO] Finished at: 2020-03-25T14:51:58+00:00
[INFO] Final Memory: 111M/3925M
[INFO] ------------------------------------------------------------------------
[ERROR] Failed to execute goal org.apache.maven.plugins:maven-compiler-plugin:3.1:compile (default-compile) on project fop-util: Compilation failure -> [Help 1]
org.apache.maven.lifecycle.LifecycleExecutionException: Failed to execute goal org.apache.maven.plugins:maven-compiler-plugin:3.1:compile (default-compile) on project fop-util: Compilation failure
        at org.apache.maven.lifecycle.internal.MojoExecutor.execute(MojoExecutor.java:212)
        at org.apache.maven.lifecycle.internal.MojoExecutor.execute(MojoExecutor.java:153)
        at org.apache.maven.lifecycle.internal.MojoExecutor.execute(MojoExecutor.java:145)
        at org.apache.maven.lifecycle.internal.LifecycleModuleBuilder.buildProject(LifecycleModuleBuilder.java:116)
        at org.apache.maven.lifecycle.internal.LifecycleModuleBuilder.buildProject(LifecycleModuleBuilder.java:80)
        at org.apache.maven.lifecycle.internal.builder.singlethreaded.SingleThreadedBuilder.build(SingleThreadedBuilder.java:51)
        at org.apache.maven.lifecycle.internal.LifecycleStarter.execute(LifecycleStarter.java:128)
        at org.apache.maven.DefaultMaven.doExecute(DefaultMaven.java:307)
        at org.apache.maven.DefaultMaven.doExecute(DefaultMaven.java:193)
        at org.apache.maven.DefaultMaven.execute(DefaultMaven.java:106)
        at org.jvnet.hudson.maven3.launcher.Maven33Launcher.main(Maven33Launcher.java:129)
        at sun.reflect.NativeMethodAccessorImpl.invoke0(Native Method)
        at sun.reflect.NativeMethodAccessorImpl.invoke(NativeMethodAccessorImpl.java:62)
        at sun.reflect.DelegatingMethodAccessorImpl.invoke(DelegatingMethodAccessorImpl.java:43)
        at java.lang.reflect.Method.invoke(Method.java:498)
        at org.codehaus.plexus.classworlds.launcher.Launcher.launchStandard(Launcher.java:330)
        at org.codehaus.plexus.classworlds.launcher.Launcher.launch(Launcher.java:238)
        at jenkins.maven3.agent.Maven33Main.launch(Maven33Main.java:178)
        at sun.reflect.NativeMethodAccessorImpl.invoke0(Native Method)
        at sun.reflect.NativeMethodAccessorImpl.invoke(NativeMethodAccessorImpl.java:62)
        at sun.reflect.DelegatingMethodAccessorImpl.invoke(DelegatingMethodAccessorImpl.java:43)
        at java.lang.reflect.Method.invoke(Method.java:498)
        at hudson.maven.Maven3Builder.call(Maven3Builder.java:139)
        at hudson.maven.Maven3Builder.call(Maven3Builder.java:70)
        at hudson.remoting.UserRequest.perform(UserRequest.java:212)
        at hudson.remoting.UserRequest.perform(UserRequest.java:54)
        at hudson.remoting.Request$2.run(Request.java:369)
        at hudson.remoting.InterceptingExecutorService$1.call(InterceptingExecutorService.java:72)
        at java.util.concurrent.FutureTask.run(FutureTask.java:266)
        at java.util.concurrent.ThreadPoolExecutor.runWorker(ThreadPoolExecutor.java:1149)
        at java.util.concurrent.ThreadPoolExecutor$Worker.run(ThreadPoolExecutor.java:624)
        at java.lang.Thread.run(Thread.java:748)
Caused by: org.apache.maven.plugin.compiler.CompilationFailureException: Compilation failure
        at org.apache.maven.plugin.compiler.AbstractCompilerMojo.execute(AbstractCompilerMojo.java:862)
        at org.apache.maven.plugin.compiler.CompilerMojo.execute(CompilerMojo.java:129)
        at org.apache.maven.plugin.DefaultBuildPluginManager.executeMojo(DefaultBuildPluginManager.java:134)
        at org.apache.maven.lifecycle.internal.MojoExecutor.execute(MojoExecutor.java:207)
        ... 31 more
[ERROR]
[ERROR] Re-run Maven using the -X switch to enable full debug logging.
[ERROR]
[ERROR] For more information about the errors and possible solutions, please read the following articles:
[ERROR] [Help 1] http://cwiki.apache.org/confluence/display/MAVEN/MojoFailureException
[ERROR]
[JENKINS] Archiving <https://builds.apache.org/job/xmlgraphics-fop/ws/fop-sandbox/pom.xml> to org.apache.xmlgraphics/fop-sandbox/2.5.0-SNAPSHOT/fop-sandbox-2.5.0-SNAPSHOT.pom
[ERROR] After correcting the problems, you can resume the build with the command
[ERROR]   mvn <goals> -rf :fop-util
[JENKINS] Archiving <https://builds.apache.org/job/xmlgraphics-fop/ws/pom.xml> to org.apache.xmlgraphics/fop-parent/2.5.0-SNAPSHOT/fop-parent-2.5.0-SNAPSHOT.pom
[JENKINS] Archiving <https://builds.apache.org/job/xmlgraphics-fop/ws/fop-core/pom.xml> to org.apache.xmlgraphics/fop-core/2.5.0-SNAPSHOT/fop-core-2.5.0-SNAPSHOT.pom
[JENKINS] Archiving <https://builds.apache.org/job/xmlgraphics-fop/ws/fop/pom.xml> to org.apache.xmlgraphics/fop/2.5.0-SNAPSHOT/fop-2.5.0-SNAPSHOT.pom
[JENKINS] Archiving <https://builds.apache.org/job/xmlgraphics-fop/ws/fop-servlet/pom.xml> to org.apache.xmlgraphics/fop-servlet/2.5.0-SNAPSHOT/fop-servlet-2.5.0-SNAPSHOT.pom
[JENKINS] Archiving <https://builds.apache.org/job/xmlgraphics-fop/ws/fop-transcoder-allinone/pom.xml> to org.apache.xmlgraphics/fop-transcoder-allinone/2.5.0-SNAPSHOT/fop-transcoder-allinone-2.5.0-SNAPSHOT.pom
[JENKINS] Archiving <https://builds.apache.org/job/xmlgraphics-fop/ws/fop-util/pom.xml> to org.apache.xmlgraphics/fop-util/2.5.0-SNAPSHOT/fop-util-2.5.0-SNAPSHOT.pom
[JENKINS] Archiving <https://builds.apache.org/job/xmlgraphics-fop/ws/fop-events/pom.xml> to org.apache.xmlgraphics/fop-events/2.5.0-SNAPSHOT/fop-events-2.5.0-SNAPSHOT.pom
[JENKINS] Archiving <https://builds.apache.org/job/xmlgraphics-fop/ws/fop-transcoder/pom.xml> to org.apache.xmlgraphics/fop-transcoder/2.5.0-SNAPSHOT/fop-transcoder-2.5.0-SNAPSHOT.pom
channel stopped
Reply | Threaded
Open this post in threaded view
|

Jenkins build is back to normal : xmlgraphics-fop #289

Apache Jenkins Server