Build failed in Jenkins: xmlgraphics-fop #243

classic Classic list List threaded Threaded
4 messages Options
Reply | Threaded
Open this post in threaded view
|

Build failed in Jenkins: xmlgraphics-fop #243

Apache Jenkins Server
See <https://builds.apache.org/job/xmlgraphics-fop/243/display/redirect?page=changes>

Changes:

[ssteiner] FOP-2856: Support compile on Java 12

------------------------------------------
Started by an SCM change
[EnvInject] - Loading node environment variables.
Building remotely on ubuntu-4 (ubuntu trusty) in workspace <https://builds.apache.org/job/xmlgraphics-fop/ws/>
Updating https://svn.apache.org/repos/asf/xmlgraphics/fop/trunk at revision '2019-04-04T12:28:11.203 +0000'
U         pom.xml
U         fop/build.xml
At revision 1856920

Parsing POMs
Modules changed, recalculating dependency graph
Established TCP socket on 35972
maven3-agent.jar already up to date
maven3-interceptor.jar already up to date
maven3-interceptor-commons.jar already up to date
[xmlgraphics-fop] $ /home/jenkins/tools/java/jdk1.8.0_144-unlimited-security/bin/java -Xmx4g -Xms4g -cp /home/jenkins/jenkins-slave/maven3-agent.jar:/home/jenkins/tools/maven/apache-maven-3.0.4/boot/plexus-classworlds-2.4.jar org.jvnet.hudson.maven3.agent.Maven3Main /home/jenkins/tools/maven/apache-maven-3.0.4 /home/jenkins/jenkins-slave/remoting.jar /home/jenkins/jenkins-slave/maven3-interceptor.jar /home/jenkins/jenkins-slave/maven3-interceptor-commons.jar 35972
<===[JENKINS REMOTING CAPACITY]===>   channel started
Executing Maven:  -B -f <https://builds.apache.org/job/xmlgraphics-fop/ws/pom.xml> -Dmaven.repo.local=/home/jenkins/jenkins-slave/maven-repositories/1 clean install checkstyle:checkstyle findbugs:findbugs -B -U -e -fae -V -Djdk.path=/home/jenkins/tools/java/jdk1.6.0_20-32-unlimited-security
Apache Maven 3.0.4 (r1232337; 2012-01-17 08:44:56+0000)
Maven home: /usr/local/asfpackages/maven/apache-maven-3.0.4
Java version: 1.8.0_144, vendor: Oracle Corporation
Java home: /usr/local/asfpackages/java/jdk1.8.0_144-unlimited-security/jre
Default locale: en_US, platform encoding: ISO-8859-1
OS name: "linux", version: "4.4.0-131-generic", arch: "amd64", family: "unix"
[INFO] Error stacktraces are turned on.
[INFO] Scanning for projects...
[INFO] ------------------------------------------------------------------------
[INFO] Reactor Build Order:
[INFO]
[INFO] Apache FOP Parent
[INFO] Apache FOP Utilities
[INFO] Apache FOP Events
[INFO] Apache FOP Core
[INFO] Apache FOP All-In-One
[INFO] Apache FOP Sandbox
[INFO] Apache FOP Servlet
[INFO] Apache FOP Transcoder
[INFO] Apache FOP Transcoder All-In-One
Downloading: http://repo.maven.apache.org/maven2/org/apache/maven/plugins/maven-javadoc-plugin/maven-metadata.xml
Downloaded: http://repo.maven.apache.org/maven2/org/apache/maven/plugins/maven-javadoc-plugin/maven-metadata.xml (2 KB at 4.0 KB/sec)
Downloading: http://repo.maven.apache.org/maven2/org/codehaus/mojo/maven-metadata.xml
Downloading: http://repo.maven.apache.org/maven2/org/apache/maven/plugins/maven-metadata.xml
Downloaded: http://repo.maven.apache.org/maven2/org/apache/maven/plugins/maven-metadata.xml (14 KB at 474.7 KB/sec)
Downloaded: http://repo.maven.apache.org/maven2/org/codehaus/mojo/maven-metadata.xml (20 KB at 476.0 KB/sec)
Downloading: http://repo.maven.apache.org/maven2/org/codehaus/mojo/findbugs-maven-plugin/maven-metadata.xml
Downloaded: http://repo.maven.apache.org/maven2/org/codehaus/mojo/findbugs-maven-plugin/maven-metadata.xml (2 KB at 57.1 KB/sec)
[INFO]                                                                        
[INFO] ------------------------------------------------------------------------
[INFO] Building Apache FOP Parent 2.4.0-SNAPSHOT
[INFO] ------------------------------------------------------------------------
[INFO]
[INFO] --- maven-clean-plugin:2.4.1:clean (default-clean) @ fop-parent ---
[INFO] Deleting <https://builds.apache.org/job/xmlgraphics-fop/ws/target>
[INFO]
[INFO] --- maven-install-plugin:2.3.1:install (default-install) @ fop-parent ---
[INFO] Installing <https://builds.apache.org/job/xmlgraphics-fop/ws/pom.xml> to /home/jenkins/jenkins-slave/maven-repositories/1/org/apache/xmlgraphics/fop-parent/2.4.0-SNAPSHOT/fop-parent-2.4.0-SNAPSHOT.pom
[INFO]
[INFO] --- maven-checkstyle-plugin:2.14:checkstyle (default-cli) @ fop-parent ---
[WARNING] Attempt to (de-)serialize anonymous class hudson.plugins.analysis.core.HealthAwareReporter$2; see: https://jenkins.io/redirect/serialization-of-anonymous-classes/
[WARNING] Attempt to (de-)serialize anonymous class hudson.plugins.analysis.core.HealthAwareReporter$3; see: https://jenkins.io/redirect/serialization-of-anonymous-classes/
[CHECKSTYLE] No report found for mojo checkstyle
[INFO]
[INFO] --- findbugs-maven-plugin:3.0.5:findbugs (default-cli) @ fop-parent ---
[FINDBUGS] No report found for mojo findbugs
[INFO]                                                                        
[INFO] ------------------------------------------------------------------------
[INFO] Building Apache FOP Utilities 2.4.0-SNAPSHOT
[INFO] ------------------------------------------------------------------------
Downloading: https://repository.apache.org/content/repositories/snapshots/org/apache/xmlgraphics/xmlgraphics-commons/2.4.0-SNAPSHOT/maven-metadata.xml
Downloading: https://repository.jboss.org/nexus/content/repositories/thirdparty-releases/org/apache/xmlgraphics/xmlgraphics-commons/2.4.0-SNAPSHOT/maven-metadata.xml
Downloaded: https://repository.apache.org/content/repositories/snapshots/org/apache/xmlgraphics/xmlgraphics-commons/2.4.0-SNAPSHOT/maven-metadata.xml (791 B at 1.0 KB/sec)
[INFO]
[INFO] --- maven-clean-plugin:2.4.1:clean (default-clean) @ fop-util ---
[INFO] Deleting <https://builds.apache.org/job/xmlgraphics-fop/ws/fop-util/target>
[INFO]
[INFO] --- maven-resources-plugin:2.5:resources (default-resources) @ fop-util ---
[debug] execute contextualize
[INFO] Using 'UTF-8' encoding to copy filtered resources.
[INFO] skip non existing resourceDirectory <https://builds.apache.org/job/xmlgraphics-fop/ws/fop-util/src/main/resources>
[INFO] Copying 2 resources to META-INF
[INFO]
[INFO] --- maven-compiler-plugin:3.1:compile (default-compile) @ fop-util ---
[INFO] Changes detected - recompiling the module!
[INFO] Compiling 3 source files to <https://builds.apache.org/job/xmlgraphics-fop/ws/fop-util/target/classes>
[INFO] -------------------------------------------------------------
[ERROR] COMPILATION ERROR :
[INFO] -------------------------------------------------------------
[ERROR] javac: invalid target release: 1.7
Usage: javac <options> <source files>
use -help for a list of possible options

[INFO] 1 error
[INFO] -------------------------------------------------------------
[INFO]                                                                        
[INFO] ------------------------------------------------------------------------
[INFO] Skipping Apache FOP Events
[INFO] This project has been banned from the build due to previous failures.
[INFO] ------------------------------------------------------------------------
[INFO]                                                                        
[INFO] ------------------------------------------------------------------------
[INFO] Skipping Apache FOP Core
[INFO] This project has been banned from the build due to previous failures.
[INFO] ------------------------------------------------------------------------
[INFO]                                                                        
[INFO] ------------------------------------------------------------------------
[INFO] Skipping Apache FOP All-In-One
[INFO] This project has been banned from the build due to previous failures.
[INFO] ------------------------------------------------------------------------
[INFO]                                                                        
[INFO] ------------------------------------------------------------------------
[INFO] Skipping Apache FOP Sandbox
[INFO] This project has been banned from the build due to previous failures.
[INFO] ------------------------------------------------------------------------
[INFO]                                                                        
[INFO] ------------------------------------------------------------------------
[INFO] Skipping Apache FOP Servlet
[INFO] This project has been banned from the build due to previous failures.
[INFO] ------------------------------------------------------------------------
[INFO]                                                                        
[INFO] ------------------------------------------------------------------------
[INFO] Skipping Apache FOP Transcoder
[INFO] This project has been banned from the build due to previous failures.
[INFO] ------------------------------------------------------------------------
[INFO]                                                                        
[INFO] ------------------------------------------------------------------------
[INFO] Skipping Apache FOP Transcoder All-In-One
[INFO] This project has been banned from the build due to previous failures.
[INFO] ------------------------------------------------------------------------
[INFO] ------------------------------------------------------------------------
[INFO] Reactor Summary:
[INFO]
[INFO] Apache FOP Parent ................................. SUCCESS [18.227s]
[INFO] Apache FOP Utilities .............................. FAILURE [3.926s]
[INFO] Apache FOP Events ................................. SKIPPED
[INFO] Apache FOP Core ................................... SKIPPED
[INFO] Apache FOP All-In-One ............................. SKIPPED
[INFO] Apache FOP Sandbox ................................ SKIPPED
[INFO] Apache FOP Servlet ................................ SKIPPED
[INFO] Apache FOP Transcoder ............................. SKIPPED
[INFO] Apache FOP Transcoder All-In-One .................. SKIPPED
[INFO] ------------------------------------------------------------------------
[INFO] BUILD FAILURE
[INFO] ------------------------------------------------------------------------
[INFO] Total time: 39.758s
[INFO] Finished at: Thu Apr 04 12:30:06 UTC 2019
[INFO] Final Memory: 63M/3925M
[INFO] ------------------------------------------------------------------------
Waiting for Jenkins to finish collecting data
[ERROR] Failed to execute goal org.apache.maven.plugins:maven-compiler-plugin:3.1:compile (default-compile) on project fop-util: Compilation failure
[ERROR] javac: invalid target release: 1.7
[ERROR] Usage: javac <options> <source files>
[ERROR] use -help for a list of possible options
[ERROR] -> [Help 1]
org.apache.maven.lifecycle.LifecycleExecutionException: Failed to execute goal org.apache.maven.plugins:maven-compiler-plugin:3.1:compile (default-compile) on project fop-util: Compilation failure
javac: invalid target release: 1.7
Usage: javac <options> <source files>
use -help for a list of possible options


        at org.apache.maven.lifecycle.internal.MojoExecutor.execute(MojoExecutor.java:213)
        at org.apache.maven.lifecycle.internal.MojoExecutor.execute(MojoExecutor.java:153)
        at org.apache.maven.lifecycle.internal.MojoExecutor.execute(MojoExecutor.java:145)
        at org.apache.maven.lifecycle.internal.LifecycleModuleBuilder.buildProject(LifecycleModuleBuilder.java:84)
        at org.apache.maven.lifecycle.internal.LifecycleModuleBuilder.buildProject(LifecycleModuleBuilder.java:59)
        at org.apache.maven.lifecycle.internal.LifecycleStarter.singleThreadedBuild(LifecycleStarter.java:183)
        at org.apache.maven.lifecycle.internal.LifecycleStarter.execute(LifecycleStarter.java:161)
        at org.apache.maven.DefaultMaven.doExecute(DefaultMaven.java:320)
        at org.apache.maven.DefaultMaven.execute(DefaultMaven.java:156)
        at org.jvnet.hudson.maven3.launcher.Maven3Launcher.main(Maven3Launcher.java:117)
        at sun.reflect.NativeMethodAccessorImpl.invoke0(Native Method)
        at sun.reflect.NativeMethodAccessorImpl.invoke(NativeMethodAccessorImpl.java:62)
        at sun.reflect.DelegatingMethodAccessorImpl.invoke(DelegatingMethodAccessorImpl.java:43)
        at java.lang.reflect.Method.invoke(Method.java:498)
        at org.codehaus.plexus.classworlds.launcher.Launcher.launchStandard(Launcher.java:329)
        at org.codehaus.plexus.classworlds.launcher.Launcher.launch(Launcher.java:239)
        at org.jvnet.hudson.maven3.agent.Maven3Main.launch(Maven3Main.java:181)
        at sun.reflect.NativeMethodAccessorImpl.invoke0(Native Method)
        at sun.reflect.NativeMethodAccessorImpl.invoke(NativeMethodAccessorImpl.java:62)
        at sun.reflect.DelegatingMethodAccessorImpl.invoke(DelegatingMethodAccessorImpl.java:43)
        at java.lang.reflect.Method.invoke(Method.java:498)
        at hudson.maven.Maven3Builder.call(Maven3Builder.java:139)
        at hudson.maven.Maven3Builder.call(Maven3Builder.java:70)
        at hudson.remoting.UserRequest.perform(UserRequest.java:212)
        at hudson.remoting.UserRequest.perform(UserRequest.java:54)
        at hudson.remoting.Request$2.run(Request.java:369)
        at hudson.remoting.InterceptingExecutorService$1.call(InterceptingExecutorService.java:72)
        at java.util.concurrent.FutureTask.run(FutureTask.java:266)
        at java.util.concurrent.ThreadPoolExecutor.runWorker(ThreadPoolExecutor.java:1149)
        at java.util.concurrent.ThreadPoolExecutor$Worker.run(ThreadPoolExecutor.java:624)
        at java.lang.Thread.run(Thread.java:748)
Caused by: org.apache.maven.plugin.compiler.CompilationFailureException: Compilation failure
javac: invalid target release: 1.7
Usage: javac <options> <source files>
use -help for a list of possible options


        at org.apache.maven.plugin.compiler.AbstractCompilerMojo.execute(AbstractCompilerMojo.java:858)
        at org.apache.maven.plugin.compiler.CompilerMojo.execute(CompilerMojo.java:129)
        at org.apache.maven.plugin.DefaultBuildPluginManager.executeMojo(DefaultBuildPluginManager.java:101)
        at org.apache.maven.lifecycle.internal.MojoExecutor.execute(MojoExecutor.java:209)
        ... 30 more
[ERROR]
[ERROR] Re-run Maven using the -X switch to enable full debug logging.
[ERROR]
[ERROR] For more information about the errors and possible solutions, please read the following articles:
[ERROR] [Help 1] http://cwiki.apache.org/confluence/display/MAVEN/MojoFailureException
[ERROR]
[ERROR] After correcting the problems, you can resume the build with the command
[ERROR]   mvn <goals> -rf :fop-util
[JENKINS] Archiving <https://builds.apache.org/job/xmlgraphics-fop/ws/fop-sandbox/pom.xml> to org.apache.xmlgraphics/fop-sandbox/2.4.0-SNAPSHOT/fop-sandbox-2.4.0-SNAPSHOT.pom
[JENKINS] Archiving <https://builds.apache.org/job/xmlgraphics-fop/ws/pom.xml> to org.apache.xmlgraphics/fop-parent/2.4.0-SNAPSHOT/fop-parent-2.4.0-SNAPSHOT.pom
[JENKINS] Archiving <https://builds.apache.org/job/xmlgraphics-fop/ws/fop-core/pom.xml> to org.apache.xmlgraphics/fop-core/2.4.0-SNAPSHOT/fop-core-2.4.0-SNAPSHOT.pom
[JENKINS] Archiving <https://builds.apache.org/job/xmlgraphics-fop/ws/fop/pom.xml> to org.apache.xmlgraphics/fop/2.4.0-SNAPSHOT/fop-2.4.0-SNAPSHOT.pom
[JENKINS] Archiving <https://builds.apache.org/job/xmlgraphics-fop/ws/fop-servlet/pom.xml> to org.apache.xmlgraphics/fop-servlet/2.4.0-SNAPSHOT/fop-servlet-2.4.0-SNAPSHOT.pom
[JENKINS] Archiving <https://builds.apache.org/job/xmlgraphics-fop/ws/fop-transcoder-allinone/pom.xml> to org.apache.xmlgraphics/fop-transcoder-allinone/2.4.0-SNAPSHOT/fop-transcoder-allinone-2.4.0-SNAPSHOT.pom
[JENKINS] Archiving <https://builds.apache.org/job/xmlgraphics-fop/ws/fop-util/pom.xml> to org.apache.xmlgraphics/fop-util/2.4.0-SNAPSHOT/fop-util-2.4.0-SNAPSHOT.pom
[JENKINS] Archiving <https://builds.apache.org/job/xmlgraphics-fop/ws/fop-events/pom.xml> to org.apache.xmlgraphics/fop-events/2.4.0-SNAPSHOT/fop-events-2.4.0-SNAPSHOT.pom
[JENKINS] Archiving <https://builds.apache.org/job/xmlgraphics-fop/ws/fop-transcoder/pom.xml> to org.apache.xmlgraphics/fop-transcoder/2.4.0-SNAPSHOT/fop-transcoder-2.4.0-SNAPSHOT.pom
channel stopped
Reply | Threaded
Open this post in threaded view
|

Build failed in Jenkins: xmlgraphics-fop #244

Apache Jenkins Server
See <https://builds.apache.org/job/xmlgraphics-fop/244/display/redirect>

------------------------------------------
[...truncated 96.69 KB...]
[INFO]
[INFO] --- maven-checkstyle-plugin:2.14:checkstyle (default-cli) @ fop-sandbox ---
[CHECKSTYLE] Parsing file <https://builds.apache.org/job/xmlgraphics-fop/ws/fop-sandbox/target/checkstyle-result.xml>
[CHECKSTYLE] Successfully parsed file <https://builds.apache.org/job/xmlgraphics-fop/ws/fop-sandbox/target/checkstyle-result.xml> of module Apache FOP Sandbox with 0 unique warnings and 0 duplicates.
[CHECKSTYLE] Ignore new warnings since this is the first valid build
[CHECKSTYLE] Plug-in Result: Success - no threshold has been exceeded
[CHECKSTYLE] Computing warning deltas based on reference build #242
[INFO]
[INFO] --- findbugs-maven-plugin:3.0.4:findbugs (default-cli) @ fop-sandbox ---
[INFO] Fork Value is true
[INFO] Done FindBugs Analysis....
[FINDBUGS] Searching for all files in <https://builds.apache.org/job/xmlgraphics-fop/ws/fop-sandbox/target> that match the pattern findbugsXml.xml
[FINDBUGS] Parsing 1 file in <https://builds.apache.org/job/xmlgraphics-fop/ws/fop-sandbox/target>
[FINDBUGS] Successfully parsed file <https://builds.apache.org/job/xmlgraphics-fop/ws/fop-sandbox/target/findbugsXml.xml> of module Apache FOP Sandbox with 0 unique warnings and 0 duplicates.
[FINDBUGS] Ignore new warnings since this is the first valid build
[FINDBUGS] Plug-in Result: Success - no threshold has been exceeded
[FINDBUGS] Computing warning deltas based on reference build #242
[INFO]                                                                        
[INFO] ------------------------------------------------------------------------
[INFO] Building Apache FOP Servlet 2.4.0-SNAPSHOT
[INFO] ------------------------------------------------------------------------
Downloading: https://repository.jboss.org/nexus/content/repositories/thirdparty-releases/org/apache/xmlgraphics/batik-all/1.11.0-SNAPSHOT/maven-metadata.xml
Downloading: https://repository.apache.org/content/repositories/snapshots/org/apache/xmlgraphics/batik-all/1.11.0-SNAPSHOT/maven-metadata.xml
Downloaded: https://repository.apache.org/content/repositories/snapshots/org/apache/xmlgraphics/batik-all/1.11.0-SNAPSHOT/maven-metadata.xml (787 B at 1.5 KB/sec)
Downloading: https://repository.jboss.org/nexus/content/repositories/thirdparty-releases/org/apache/xmlgraphics/batik-codec/1.11.0-SNAPSHOT/maven-metadata.xml
Downloading: https://repository.apache.org/content/repositories/snapshots/org/apache/xmlgraphics/batik-codec/1.11.0-SNAPSHOT/maven-metadata.xml
Downloaded: https://repository.apache.org/content/repositories/snapshots/org/apache/xmlgraphics/batik-codec/1.11.0-SNAPSHOT/maven-metadata.xml (789 B at 1.8 KB/sec)
Downloading: https://repository.apache.org/content/repositories/snapshots/org/apache/xmlgraphics/batik-gui-util/1.11.0-SNAPSHOT/maven-metadata.xml
Downloading: https://repository.jboss.org/nexus/content/repositories/thirdparty-releases/org/apache/xmlgraphics/batik-gui-util/1.11.0-SNAPSHOT/maven-metadata.xml
Downloaded: https://repository.apache.org/content/repositories/snapshots/org/apache/xmlgraphics/batik-gui-util/1.11.0-SNAPSHOT/maven-metadata.xml (792 B at 1.8 KB/sec)
Downloading: https://repository.jboss.org/nexus/content/repositories/thirdparty-releases/org/apache/xmlgraphics/batik-rasterizer-ext/1.11.0-SNAPSHOT/maven-metadata.xml
Downloading: https://repository.apache.org/content/repositories/snapshots/org/apache/xmlgraphics/batik-rasterizer-ext/1.11.0-SNAPSHOT/maven-metadata.xml
Downloaded: https://repository.apache.org/content/repositories/snapshots/org/apache/xmlgraphics/batik-rasterizer-ext/1.11.0-SNAPSHOT/maven-metadata.xml (798 B at 1.8 KB/sec)
Downloading: https://repository.apache.org/content/repositories/snapshots/org/apache/xmlgraphics/batik-svgrasterizer/1.11.0-SNAPSHOT/maven-metadata.xml
Downloading: https://repository.jboss.org/nexus/content/repositories/thirdparty-releases/org/apache/xmlgraphics/batik-svgrasterizer/1.11.0-SNAPSHOT/maven-metadata.xml
Downloaded: https://repository.apache.org/content/repositories/snapshots/org/apache/xmlgraphics/batik-svgrasterizer/1.11.0-SNAPSHOT/maven-metadata.xml (797 B at 1.8 KB/sec)
Downloading: https://repository.jboss.org/nexus/content/repositories/thirdparty-releases/org/apache/xmlgraphics/batik-rasterizer/1.11.0-SNAPSHOT/maven-metadata.xml
Downloading: https://repository.apache.org/content/repositories/snapshots/org/apache/xmlgraphics/batik-rasterizer/1.11.0-SNAPSHOT/maven-metadata.xml
Downloaded: https://repository.apache.org/content/repositories/snapshots/org/apache/xmlgraphics/batik-rasterizer/1.11.0-SNAPSHOT/maven-metadata.xml (794 B at 1.8 KB/sec)
Downloading: https://repository.apache.org/content/repositories/snapshots/org/apache/xmlgraphics/batik-slideshow/1.11.0-SNAPSHOT/maven-metadata.xml
Downloading: https://repository.jboss.org/nexus/content/repositories/thirdparty-releases/org/apache/xmlgraphics/batik-slideshow/1.11.0-SNAPSHOT/maven-metadata.xml
Downloaded: https://repository.apache.org/content/repositories/snapshots/org/apache/xmlgraphics/batik-slideshow/1.11.0-SNAPSHOT/maven-metadata.xml (793 B at 1.8 KB/sec)
Downloading: https://repository.jboss.org/nexus/content/repositories/thirdparty-releases/org/apache/xmlgraphics/batik-squiggle-ext/1.11.0-SNAPSHOT/maven-metadata.xml
Downloading: https://repository.apache.org/content/repositories/snapshots/org/apache/xmlgraphics/batik-squiggle-ext/1.11.0-SNAPSHOT/maven-metadata.xml
Downloaded: https://repository.apache.org/content/repositories/snapshots/org/apache/xmlgraphics/batik-squiggle-ext/1.11.0-SNAPSHOT/maven-metadata.xml (796 B at 1.8 KB/sec)
Downloading: https://repository.jboss.org/nexus/content/repositories/thirdparty-releases/org/apache/xmlgraphics/batik-svgbrowser/1.11.0-SNAPSHOT/maven-metadata.xml
Downloading: https://repository.apache.org/content/repositories/snapshots/org/apache/xmlgraphics/batik-svgbrowser/1.11.0-SNAPSHOT/maven-metadata.xml
Downloaded: https://repository.apache.org/content/repositories/snapshots/org/apache/xmlgraphics/batik-svgbrowser/1.11.0-SNAPSHOT/maven-metadata.xml (794 B at 1.8 KB/sec)
Downloading: https://repository.apache.org/content/repositories/snapshots/org/apache/xmlgraphics/batik-swing/1.11.0-SNAPSHOT/maven-metadata.xml
Downloading: https://repository.jboss.org/nexus/content/repositories/thirdparty-releases/org/apache/xmlgraphics/batik-swing/1.11.0-SNAPSHOT/maven-metadata.xml
Downloaded: https://repository.apache.org/content/repositories/snapshots/org/apache/xmlgraphics/batik-swing/1.11.0-SNAPSHOT/maven-metadata.xml (789 B at 1.8 KB/sec)
Downloading: https://repository.apache.org/content/repositories/snapshots/org/apache/xmlgraphics/batik-squiggle/1.11.0-SNAPSHOT/maven-metadata.xml
Downloading: https://repository.jboss.org/nexus/content/repositories/thirdparty-releases/org/apache/xmlgraphics/batik-squiggle/1.11.0-SNAPSHOT/maven-metadata.xml
Downloaded: https://repository.apache.org/content/repositories/snapshots/org/apache/xmlgraphics/batik-squiggle/1.11.0-SNAPSHOT/maven-metadata.xml (792 B at 1.8 KB/sec)
Downloading: https://repository.apache.org/content/repositories/snapshots/org/apache/xmlgraphics/batik-svgpp/1.11.0-SNAPSHOT/maven-metadata.xml
Downloading: https://repository.jboss.org/nexus/content/repositories/thirdparty-releases/org/apache/xmlgraphics/batik-svgpp/1.11.0-SNAPSHOT/maven-metadata.xml
Downloaded: https://repository.apache.org/content/repositories/snapshots/org/apache/xmlgraphics/batik-svgpp/1.11.0-SNAPSHOT/maven-metadata.xml (789 B at 1.8 KB/sec)
Downloading: https://repository.apache.org/content/repositories/snapshots/org/apache/xmlgraphics/batik-ttf2svg/1.11.0-SNAPSHOT/maven-metadata.xml
Downloading: https://repository.jboss.org/nexus/content/repositories/thirdparty-releases/org/apache/xmlgraphics/batik-ttf2svg/1.11.0-SNAPSHOT/maven-metadata.xml
Downloaded: https://repository.apache.org/content/repositories/snapshots/org/apache/xmlgraphics/batik-ttf2svg/1.11.0-SNAPSHOT/maven-metadata.xml (791 B at 1.8 KB/sec)
[INFO]
[INFO] --- maven-clean-plugin:2.4.1:clean (default-clean) @ fop-servlet ---
[INFO] Deleting <https://builds.apache.org/job/xmlgraphics-fop/ws/fop-servlet/target>
[INFO]
[INFO] --- maven-resources-plugin:2.5:resources (default-resources) @ fop-servlet ---
[debug] execute contextualize
[INFO] Using 'UTF-8' encoding to copy filtered resources.
[INFO] skip non existing resourceDirectory <https://builds.apache.org/job/xmlgraphics-fop/ws/fop-servlet/src/main/resources>
[INFO]
[INFO] --- maven-compiler-plugin:3.1:compile (default-compile) @ fop-servlet ---
[INFO] No sources to compile
[INFO]
[INFO] --- maven-resources-plugin:2.5:testResources (default-testResources) @ fop-servlet ---
[debug] execute contextualize
[INFO] Using 'UTF-8' encoding to copy filtered resources.
[INFO] skip non existing resourceDirectory <https://builds.apache.org/job/xmlgraphics-fop/ws/fop-servlet/src/test/resources>
[INFO]
[INFO] --- maven-compiler-plugin:3.1:testCompile (default-testCompile) @ fop-servlet ---
[INFO] No sources to compile
[INFO]
[INFO] --- maven-surefire-plugin:2.18.1:test (default-test) @ fop-servlet ---
[INFO] No tests to run.
[JENKINS] Recording test results
[INFO]
[INFO] --- maven-war-plugin:2.2:war (default-war) @ fop-servlet ---
[INFO] Packaging webapp
[INFO] Assembling webapp [fop-servlet] in [<https://builds.apache.org/job/xmlgraphics-fop/ws/fop-servlet/target/fop-servlet-2.4.0-SNAPSHOT]>
[INFO] Processing war project
[INFO] Copying webapp resources [<https://builds.apache.org/job/xmlgraphics-fop/ws/fop-servlet/src/main/webapp]>
[INFO] Webapp assembled in [100 msecs]
[INFO] Building war: <https://builds.apache.org/job/xmlgraphics-fop/ws/fop-servlet/target/fop-servlet-2.4.0-SNAPSHOT.war>
[INFO]
[INFO] --- maven-install-plugin:2.3.1:install (default-install) @ fop-servlet ---
[INFO] Installing <https://builds.apache.org/job/xmlgraphics-fop/ws/fop-servlet/target/fop-servlet-2.4.0-SNAPSHOT.war> to /home/jenkins/jenkins-slave/maven-repositories/1/org/apache/xmlgraphics/fop-servlet/2.4.0-SNAPSHOT/fop-servlet-2.4.0-SNAPSHOT.war
[INFO] Installing <https://builds.apache.org/job/xmlgraphics-fop/ws/fop-servlet/pom.xml> to /home/jenkins/jenkins-slave/maven-repositories/1/org/apache/xmlgraphics/fop-servlet/2.4.0-SNAPSHOT/fop-servlet-2.4.0-SNAPSHOT.pom
[INFO]
[INFO] --- maven-checkstyle-plugin:2.14:checkstyle (default-cli) @ fop-servlet ---
[CHECKSTYLE] No report found for mojo checkstyle
[INFO]
[INFO] --- findbugs-maven-plugin:3.0.5:findbugs (default-cli) @ fop-servlet ---
[FINDBUGS] No report found for mojo findbugs
[INFO]                                                                        
[INFO] ------------------------------------------------------------------------
[INFO] Building Apache FOP Transcoder 2.4.0-SNAPSHOT
[INFO] ------------------------------------------------------------------------
[INFO]
[INFO] --- maven-clean-plugin:2.4.1:clean (default-clean) @ fop-transcoder ---
[INFO] Deleting <https://builds.apache.org/job/xmlgraphics-fop/ws/fop-transcoder/target>
[INFO]
[INFO] --- maven-resources-plugin:2.5:resources (default-resources) @ fop-transcoder ---
[debug] execute contextualize
[INFO] Using 'UTF-8' encoding to copy filtered resources.
[INFO] skip non existing resourceDirectory <https://builds.apache.org/job/xmlgraphics-fop/ws/fop-transcoder/src/main/resources>
[INFO]
[INFO] --- maven-compiler-plugin:3.1:compile (default-compile) @ fop-transcoder ---
[INFO] No sources to compile
[INFO]
[INFO] --- maven-resources-plugin:2.5:testResources (default-testResources) @ fop-transcoder ---
[debug] execute contextualize
[INFO] Using 'UTF-8' encoding to copy filtered resources.
[INFO] skip non existing resourceDirectory <https://builds.apache.org/job/xmlgraphics-fop/ws/fop-transcoder/src/test/resources>
[INFO]
[INFO] --- maven-compiler-plugin:3.1:testCompile (default-testCompile) @ fop-transcoder ---
[INFO] No sources to compile
[INFO]
[INFO] --- maven-surefire-plugin:2.18.1:test (default-test) @ fop-transcoder ---
[INFO] No tests to run.
[JENKINS] Recording test results
[INFO]
[INFO] --- maven-jar-plugin:3.1.1:jar (default-jar) @ fop-transcoder ---
[WARNING] JAR will be empty - no content was marked for inclusion!
[INFO] Building jar: <https://builds.apache.org/job/xmlgraphics-fop/ws/fop-transcoder/target/fop-transcoder-2.4.0-SNAPSHOT.jar>
[INFO]
[INFO] --- maven-assembly-plugin:2.2-beta-5:single (package-all) @ fop-transcoder ---
[INFO] Reading assembly descriptor: src/tools/resources/assembly/assembly.xml
[WARNING] Artifact: org.apache.xmlgraphics:fop-transcoder:jar:2.4.0-SNAPSHOT references the same file as the assembly destination file. Moving it to a temporary location for inclusion.
[INFO] Building jar: <https://builds.apache.org/job/xmlgraphics-fop/ws/fop-transcoder/target/fop-transcoder-2.4.0-SNAPSHOT.jar>
[WARNING] Configuration options: 'appendAssemblyId' is set to false, and 'classifier' is missing.
Instead of attaching the assembly file: <https://builds.apache.org/job/xmlgraphics-fop/ws/fop-transcoder/target/fop-transcoder-2.4.0-SNAPSHOT.jar,> it will become the file for main project artifact.
NOTE: If multiple descriptors or descriptor-formats are provided for this project, the value of this file will be non-deterministic!
[WARNING] Replacing pre-existing project main-artifact file: <https://builds.apache.org/job/xmlgraphics-fop/ws/fop-transcoder/target/archive-tmp/fop-transcoder-2.4.0-SNAPSHOT.jar>
with assembly file: <https://builds.apache.org/job/xmlgraphics-fop/ws/fop-transcoder/target/fop-transcoder-2.4.0-SNAPSHOT.jar>
[INFO]
[INFO] --- maven-install-plugin:2.3.1:install (default-install) @ fop-transcoder ---
[INFO] Installing <https://builds.apache.org/job/xmlgraphics-fop/ws/fop-transcoder/target/fop-transcoder-2.4.0-SNAPSHOT.jar> to /home/jenkins/jenkins-slave/maven-repositories/1/org/apache/xmlgraphics/fop-transcoder/2.4.0-SNAPSHOT/fop-transcoder-2.4.0-SNAPSHOT.jar
[INFO] Installing <https://builds.apache.org/job/xmlgraphics-fop/ws/fop-transcoder/pom.xml> to /home/jenkins/jenkins-slave/maven-repositories/1/org/apache/xmlgraphics/fop-transcoder/2.4.0-SNAPSHOT/fop-transcoder-2.4.0-SNAPSHOT.pom
[INFO]
[INFO] --- maven-checkstyle-plugin:2.14:checkstyle (default-cli) @ fop-transcoder ---
[CHECKSTYLE] No report found for mojo checkstyle
[INFO]
[INFO] --- findbugs-maven-plugin:3.0.5:findbugs (default-cli) @ fop-transcoder ---
[FINDBUGS] No report found for mojo findbugs
[INFO]                                                                        
[INFO] ------------------------------------------------------------------------
[INFO] Building Apache FOP Transcoder All-In-One 2.4.0-SNAPSHOT
[INFO] ------------------------------------------------------------------------
[INFO]
[INFO] --- maven-clean-plugin:2.4.1:clean (default-clean) @ fop-transcoder-allinone ---
[INFO] Deleting <https://builds.apache.org/job/xmlgraphics-fop/ws/fop-transcoder-allinone/target>
[INFO]
[INFO] --- maven-resources-plugin:2.5:resources (default-resources) @ fop-transcoder-allinone ---
[debug] execute contextualize
[INFO] Using 'UTF-8' encoding to copy filtered resources.
[INFO] skip non existing resourceDirectory <https://builds.apache.org/job/xmlgraphics-fop/ws/fop-transcoder-allinone/src/main/resources>
[INFO]
[INFO] --- maven-compiler-plugin:3.1:compile (default-compile) @ fop-transcoder-allinone ---
[INFO] No sources to compile
[INFO]
[INFO] --- maven-resources-plugin:2.5:testResources (default-testResources) @ fop-transcoder-allinone ---
[debug] execute contextualize
[INFO] Using 'UTF-8' encoding to copy filtered resources.
[INFO] skip non existing resourceDirectory <https://builds.apache.org/job/xmlgraphics-fop/ws/fop-transcoder-allinone/src/test/resources>
[INFO]
[INFO] --- maven-compiler-plugin:3.1:testCompile (default-testCompile) @ fop-transcoder-allinone ---
[INFO] No sources to compile
[INFO]
[INFO] --- maven-surefire-plugin:2.18.1:test (default-test) @ fop-transcoder-allinone ---
[INFO] No tests to run.
[JENKINS] Recording test results
[INFO]
[INFO] --- maven-jar-plugin:3.1.1:jar (default-jar) @ fop-transcoder-allinone ---
[WARNING] JAR will be empty - no content was marked for inclusion!
[INFO] Building jar: <https://builds.apache.org/job/xmlgraphics-fop/ws/fop-transcoder-allinone/target/fop-transcoder-allinone-2.4.0-SNAPSHOT.jar>
[INFO]
[INFO] --- maven-assembly-plugin:2.2-beta-5:single (package-all) @ fop-transcoder-allinone ---
[INFO] Reading assembly descriptor: src/tools/resources/assembly/assembly.xml
[WARNING] Artifact: org.apache.xmlgraphics:fop-transcoder-allinone:jar:2.4.0-SNAPSHOT references the same file as the assembly destination file. Moving it to a temporary location for inclusion.
[INFO] Building jar: <https://builds.apache.org/job/xmlgraphics-fop/ws/fop-transcoder-allinone/target/fop-transcoder-allinone-2.4.0-SNAPSHOT.jar>
[WARNING] Configuration options: 'appendAssemblyId' is set to false, and 'classifier' is missing.
Instead of attaching the assembly file: <https://builds.apache.org/job/xmlgraphics-fop/ws/fop-transcoder-allinone/target/fop-transcoder-allinone-2.4.0-SNAPSHOT.jar,> it will become the file for main project artifact.
NOTE: If multiple descriptors or descriptor-formats are provided for this project, the value of this file will be non-deterministic!
[WARNING] Replacing pre-existing project main-artifact file: <https://builds.apache.org/job/xmlgraphics-fop/ws/fop-transcoder-allinone/target/archive-tmp/fop-transcoder-allinone-2.4.0-SNAPSHOT.jar>
with assembly file: <https://builds.apache.org/job/xmlgraphics-fop/ws/fop-transcoder-allinone/target/fop-transcoder-allinone-2.4.0-SNAPSHOT.jar>
[INFO]
[INFO] --- maven-install-plugin:2.3.1:install (default-install) @ fop-transcoder-allinone ---
[INFO] Installing <https://builds.apache.org/job/xmlgraphics-fop/ws/fop-transcoder-allinone/target/fop-transcoder-allinone-2.4.0-SNAPSHOT.jar> to /home/jenkins/jenkins-slave/maven-repositories/1/org/apache/xmlgraphics/fop-transcoder-allinone/2.4.0-SNAPSHOT/fop-transcoder-allinone-2.4.0-SNAPSHOT.jar
[INFO] Installing <https://builds.apache.org/job/xmlgraphics-fop/ws/fop-transcoder-allinone/pom.xml> to /home/jenkins/jenkins-slave/maven-repositories/1/org/apache/xmlgraphics/fop-transcoder-allinone/2.4.0-SNAPSHOT/fop-transcoder-allinone-2.4.0-SNAPSHOT.pom
[INFO]
[INFO] --- maven-checkstyle-plugin:2.14:checkstyle (default-cli) @ fop-transcoder-allinone ---
[CHECKSTYLE] No report found for mojo checkstyle
[INFO]
[INFO] --- findbugs-maven-plugin:3.0.5:findbugs (default-cli) @ fop-transcoder-allinone ---
[FINDBUGS] No report found for mojo findbugs
[INFO] ------------------------------------------------------------------------
[INFO] Reactor Summary:
[INFO]
[INFO] Apache FOP Parent ................................. SUCCESS [19.439s]
[INFO] Apache FOP Utilities .............................. SUCCESS [2:29.372s]
[INFO] Apache FOP Events ................................. SUCCESS [31.797s]
[INFO] Apache FOP Core ................................... SUCCESS [4:26.827s]
[INFO] Apache FOP All-In-One ............................. SUCCESS [13.269s]
[INFO] Apache FOP Sandbox ................................ SUCCESS [14.326s]
[INFO] Apache FOP Servlet ................................ SUCCESS [10.997s]
[INFO] Apache FOP Transcoder ............................. SUCCESS [4.718s]
[INFO] Apache FOP Transcoder All-In-One .................. SUCCESS [4.734s]
[INFO] ------------------------------------------------------------------------
[INFO] BUILD SUCCESS
[INFO] ------------------------------------------------------------------------
[INFO] Total time: 9:15.377s
[INFO] Finished at: Thu Apr 04 12:57:03 UTC 2019
[INFO] Final Memory: 86M/4051M
[INFO] ------------------------------------------------------------------------
Waiting for Jenkins to finish collecting data
[JENKINS] Archiving <https://builds.apache.org/job/xmlgraphics-fop/ws/fop-sandbox/pom.xml> to org.apache.xmlgraphics/fop-sandbox/2.4.0-SNAPSHOT/fop-sandbox-2.4.0-SNAPSHOT.pom
[JENKINS] Archiving <https://builds.apache.org/job/xmlgraphics-fop/ws/fop-sandbox/target/fop-sandbox-2.4.0-SNAPSHOT.jar> to org.apache.xmlgraphics/fop-sandbox/2.4.0-SNAPSHOT/fop-sandbox-2.4.0-SNAPSHOT.jar
[JENKINS] Archiving <https://builds.apache.org/job/xmlgraphics-fop/ws/pom.xml> to org.apache.xmlgraphics/fop-parent/2.4.0-SNAPSHOT/fop-parent-2.4.0-SNAPSHOT.pom
[JENKINS] Archiving <https://builds.apache.org/job/xmlgraphics-fop/ws/fop-core/pom.xml> to org.apache.xmlgraphics/fop-core/2.4.0-SNAPSHOT/fop-core-2.4.0-SNAPSHOT.pom
[JENKINS] Archiving <https://builds.apache.org/job/xmlgraphics-fop/ws/fop-core/target/fop-core-2.4.0-SNAPSHOT.jar> to org.apache.xmlgraphics/fop-core/2.4.0-SNAPSHOT/fop-core-2.4.0-SNAPSHOT.jar
[JENKINS] Archiving <https://builds.apache.org/job/xmlgraphics-fop/ws/fop/pom.xml> to org.apache.xmlgraphics/fop/2.4.0-SNAPSHOT/fop-2.4.0-SNAPSHOT.pom
[JENKINS] Archiving <https://builds.apache.org/job/xmlgraphics-fop/ws/fop/target/fop-2.4.0-SNAPSHOT.jar> to org.apache.xmlgraphics/fop/2.4.0-SNAPSHOT/fop-2.4.0-SNAPSHOT.jar
[JENKINS] Archiving <https://builds.apache.org/job/xmlgraphics-fop/ws/fop-servlet/pom.xml> to org.apache.xmlgraphics/fop-servlet/2.4.0-SNAPSHOT/fop-servlet-2.4.0-SNAPSHOT.pom
[JENKINS] Archiving <https://builds.apache.org/job/xmlgraphics-fop/ws/fop-servlet/target/fop-servlet-2.4.0-SNAPSHOT.war> to org.apache.xmlgraphics/fop-servlet/2.4.0-SNAPSHOT/fop-servlet-2.4.0-SNAPSHOT.war
[Fast Archiver] Compressed 8.20 MB of artifacts by 51.5% relative to #242
[JENKINS] Archiving <https://builds.apache.org/job/xmlgraphics-fop/ws/fop-transcoder-allinone/pom.xml> to org.apache.xmlgraphics/fop-transcoder-allinone/2.4.0-SNAPSHOT/fop-transcoder-allinone-2.4.0-SNAPSHOT.pom
[JENKINS] Archiving <https://builds.apache.org/job/xmlgraphics-fop/ws/fop-transcoder-allinone/target/fop-transcoder-allinone-2.4.0-SNAPSHOT.jar> to org.apache.xmlgraphics/fop-transcoder-allinone/2.4.0-SNAPSHOT/fop-transcoder-allinone-2.4.0-SNAPSHOT.jar
[JENKINS] Archiving <https://builds.apache.org/job/xmlgraphics-fop/ws/fop-util/pom.xml> to org.apache.xmlgraphics/fop-util/2.4.0-SNAPSHOT/fop-util-2.4.0-SNAPSHOT.pom
[JENKINS] Archiving <https://builds.apache.org/job/xmlgraphics-fop/ws/fop-util/target/fop-util-2.4.0-SNAPSHOT.jar> to org.apache.xmlgraphics/fop-util/2.4.0-SNAPSHOT/fop-util-2.4.0-SNAPSHOT.jar
[JENKINS] Archiving <https://builds.apache.org/job/xmlgraphics-fop/ws/fop-events/pom.xml> to org.apache.xmlgraphics/fop-events/2.4.0-SNAPSHOT/fop-events-2.4.0-SNAPSHOT.pom
[JENKINS] Archiving <https://builds.apache.org/job/xmlgraphics-fop/ws/fop-events/target/fop-events-2.4.0-SNAPSHOT.jar> to org.apache.xmlgraphics/fop-events/2.4.0-SNAPSHOT/fop-events-2.4.0-SNAPSHOT.jar
[JENKINS] Archiving <https://builds.apache.org/job/xmlgraphics-fop/ws/fop-transcoder/pom.xml> to org.apache.xmlgraphics/fop-transcoder/2.4.0-SNAPSHOT/fop-transcoder-2.4.0-SNAPSHOT.pom
[JENKINS] Archiving <https://builds.apache.org/job/xmlgraphics-fop/ws/fop-transcoder/target/fop-transcoder-2.4.0-SNAPSHOT.jar> to org.apache.xmlgraphics/fop-transcoder/2.4.0-SNAPSHOT/fop-transcoder-2.4.0-SNAPSHOT.jar
[CHECKSTYLE] Plug-in Result: Success - no threshold has been exceeded
[CHECKSTYLE] Plug-in Result: Success - no threshold has been exceeded
[CHECKSTYLE] Plug-in Result: Success - no threshold has been exceeded
[FINDBUGS] Plug-in Result: Success - no threshold has been exceeded
[FINDBUGS] Plug-in Result: Success - no threshold has been exceeded
[FINDBUGS] Plug-in Result: Failed - <a href="findbugsResult">2 warnings</a> exceed the threshold of 1 by 1
[FINDBUGS] Plug-in Result: Failed - <a href="findbugsResult">2 warnings</a> exceed the threshold of 1 by 1
channel stopped
Reply | Threaded
Open this post in threaded view
|

Build failed in Jenkins: xmlgraphics-fop #245

Apache Jenkins Server
See <https://builds.apache.org/job/xmlgraphics-fop/245/display/redirect>

------------------------------------------
[...truncated 98.13 KB...]
[INFO]
[INFO] --- maven-checkstyle-plugin:2.14:checkstyle (default-cli) @ fop-sandbox ---
[CHECKSTYLE] Parsing file <https://builds.apache.org/job/xmlgraphics-fop/ws/fop-sandbox/target/checkstyle-result.xml>
[CHECKSTYLE] Successfully parsed file <https://builds.apache.org/job/xmlgraphics-fop/ws/fop-sandbox/target/checkstyle-result.xml> of module Apache FOP Sandbox with 0 unique warnings and 0 duplicates.
[CHECKSTYLE] Ignore new warnings since this is the first valid build
[CHECKSTYLE] Plug-in Result: Success - no threshold has been exceeded
[CHECKSTYLE] Computing warning deltas based on reference build #244
[INFO]
[INFO] --- findbugs-maven-plugin:3.0.4:findbugs (default-cli) @ fop-sandbox ---
[INFO] Fork Value is true
[INFO] Done FindBugs Analysis....
[FINDBUGS] Searching for all files in <https://builds.apache.org/job/xmlgraphics-fop/ws/fop-sandbox/target> that match the pattern findbugsXml.xml
[FINDBUGS] Parsing 1 file in <https://builds.apache.org/job/xmlgraphics-fop/ws/fop-sandbox/target>
[FINDBUGS] Successfully parsed file <https://builds.apache.org/job/xmlgraphics-fop/ws/fop-sandbox/target/findbugsXml.xml> of module Apache FOP Sandbox with 0 unique warnings and 0 duplicates.
[FINDBUGS] Ignore new warnings since this is the first valid build
[FINDBUGS] Plug-in Result: Success - no threshold has been exceeded
[FINDBUGS] Computing warning deltas based on reference build #244
[INFO]                                                                        
[INFO] ------------------------------------------------------------------------
[INFO] Building Apache FOP Servlet 2.4.0-SNAPSHOT
[INFO] ------------------------------------------------------------------------
Downloading: https://repository.apache.org/content/repositories/snapshots/org/apache/xmlgraphics/batik-all/1.11.0-SNAPSHOT/maven-metadata.xml
Downloading: https://repository.jboss.org/nexus/content/repositories/thirdparty-releases/org/apache/xmlgraphics/batik-all/1.11.0-SNAPSHOT/maven-metadata.xml
Downloaded: https://repository.apache.org/content/repositories/snapshots/org/apache/xmlgraphics/batik-all/1.11.0-SNAPSHOT/maven-metadata.xml (787 B at 1.4 KB/sec)
Downloading: https://repository.jboss.org/nexus/content/repositories/thirdparty-releases/org/apache/xmlgraphics/batik-codec/1.11.0-SNAPSHOT/maven-metadata.xml
Downloading: https://repository.apache.org/content/repositories/snapshots/org/apache/xmlgraphics/batik-codec/1.11.0-SNAPSHOT/maven-metadata.xml
Downloaded: https://repository.apache.org/content/repositories/snapshots/org/apache/xmlgraphics/batik-codec/1.11.0-SNAPSHOT/maven-metadata.xml (789 B at 1.8 KB/sec)
Downloading: https://repository.apache.org/content/repositories/snapshots/org/apache/xmlgraphics/batik-gui-util/1.11.0-SNAPSHOT/maven-metadata.xml
Downloading: https://repository.jboss.org/nexus/content/repositories/thirdparty-releases/org/apache/xmlgraphics/batik-gui-util/1.11.0-SNAPSHOT/maven-metadata.xml
Downloaded: https://repository.apache.org/content/repositories/snapshots/org/apache/xmlgraphics/batik-gui-util/1.11.0-SNAPSHOT/maven-metadata.xml (792 B at 1.9 KB/sec)
Downloading: https://repository.apache.org/content/repositories/snapshots/org/apache/xmlgraphics/batik-rasterizer-ext/1.11.0-SNAPSHOT/maven-metadata.xml
Downloading: https://repository.jboss.org/nexus/content/repositories/thirdparty-releases/org/apache/xmlgraphics/batik-rasterizer-ext/1.11.0-SNAPSHOT/maven-metadata.xml
Downloaded: https://repository.apache.org/content/repositories/snapshots/org/apache/xmlgraphics/batik-rasterizer-ext/1.11.0-SNAPSHOT/maven-metadata.xml (798 B at 1.9 KB/sec)
Downloading: https://repository.apache.org/content/repositories/snapshots/org/apache/xmlgraphics/batik-svgrasterizer/1.11.0-SNAPSHOT/maven-metadata.xml
Downloading: https://repository.jboss.org/nexus/content/repositories/thirdparty-releases/org/apache/xmlgraphics/batik-svgrasterizer/1.11.0-SNAPSHOT/maven-metadata.xml
Downloaded: https://repository.apache.org/content/repositories/snapshots/org/apache/xmlgraphics/batik-svgrasterizer/1.11.0-SNAPSHOT/maven-metadata.xml (797 B at 1.8 KB/sec)
Downloading: https://repository.apache.org/content/repositories/snapshots/org/apache/xmlgraphics/batik-rasterizer/1.11.0-SNAPSHOT/maven-metadata.xml
Downloading: https://repository.jboss.org/nexus/content/repositories/thirdparty-releases/org/apache/xmlgraphics/batik-rasterizer/1.11.0-SNAPSHOT/maven-metadata.xml
Downloaded: https://repository.apache.org/content/repositories/snapshots/org/apache/xmlgraphics/batik-rasterizer/1.11.0-SNAPSHOT/maven-metadata.xml (794 B at 1.6 KB/sec)
Downloading: https://repository.apache.org/content/repositories/snapshots/org/apache/xmlgraphics/batik-slideshow/1.11.0-SNAPSHOT/maven-metadata.xml
Downloading: https://repository.jboss.org/nexus/content/repositories/thirdparty-releases/org/apache/xmlgraphics/batik-slideshow/1.11.0-SNAPSHOT/maven-metadata.xml
Downloaded: https://repository.apache.org/content/repositories/snapshots/org/apache/xmlgraphics/batik-slideshow/1.11.0-SNAPSHOT/maven-metadata.xml (793 B at 1.8 KB/sec)
Downloading: https://repository.jboss.org/nexus/content/repositories/thirdparty-releases/org/apache/xmlgraphics/batik-squiggle-ext/1.11.0-SNAPSHOT/maven-metadata.xml
Downloading: https://repository.apache.org/content/repositories/snapshots/org/apache/xmlgraphics/batik-squiggle-ext/1.11.0-SNAPSHOT/maven-metadata.xml
Downloaded: https://repository.apache.org/content/repositories/snapshots/org/apache/xmlgraphics/batik-squiggle-ext/1.11.0-SNAPSHOT/maven-metadata.xml (796 B at 1.8 KB/sec)
Downloading: https://repository.jboss.org/nexus/content/repositories/thirdparty-releases/org/apache/xmlgraphics/batik-svgbrowser/1.11.0-SNAPSHOT/maven-metadata.xml
Downloading: https://repository.apache.org/content/repositories/snapshots/org/apache/xmlgraphics/batik-svgbrowser/1.11.0-SNAPSHOT/maven-metadata.xml
Downloaded: https://repository.apache.org/content/repositories/snapshots/org/apache/xmlgraphics/batik-svgbrowser/1.11.0-SNAPSHOT/maven-metadata.xml (794 B at 1.8 KB/sec)
Downloading: https://repository.apache.org/content/repositories/snapshots/org/apache/xmlgraphics/batik-swing/1.11.0-SNAPSHOT/maven-metadata.xml
Downloading: https://repository.jboss.org/nexus/content/repositories/thirdparty-releases/org/apache/xmlgraphics/batik-swing/1.11.0-SNAPSHOT/maven-metadata.xml
Downloaded: https://repository.apache.org/content/repositories/snapshots/org/apache/xmlgraphics/batik-swing/1.11.0-SNAPSHOT/maven-metadata.xml (789 B at 1.8 KB/sec)
Downloading: https://repository.apache.org/content/repositories/snapshots/org/apache/xmlgraphics/batik-squiggle/1.11.0-SNAPSHOT/maven-metadata.xml
Downloading: https://repository.jboss.org/nexus/content/repositories/thirdparty-releases/org/apache/xmlgraphics/batik-squiggle/1.11.0-SNAPSHOT/maven-metadata.xml
Downloaded: https://repository.apache.org/content/repositories/snapshots/org/apache/xmlgraphics/batik-squiggle/1.11.0-SNAPSHOT/maven-metadata.xml (792 B at 1.9 KB/sec)
Downloading: https://repository.apache.org/content/repositories/snapshots/org/apache/xmlgraphics/batik-svgpp/1.11.0-SNAPSHOT/maven-metadata.xml
Downloading: https://repository.jboss.org/nexus/content/repositories/thirdparty-releases/org/apache/xmlgraphics/batik-svgpp/1.11.0-SNAPSHOT/maven-metadata.xml
Downloaded: https://repository.apache.org/content/repositories/snapshots/org/apache/xmlgraphics/batik-svgpp/1.11.0-SNAPSHOT/maven-metadata.xml (789 B at 1.8 KB/sec)
Downloading: https://repository.apache.org/content/repositories/snapshots/org/apache/xmlgraphics/batik-ttf2svg/1.11.0-SNAPSHOT/maven-metadata.xml
Downloading: https://repository.jboss.org/nexus/content/repositories/thirdparty-releases/org/apache/xmlgraphics/batik-ttf2svg/1.11.0-SNAPSHOT/maven-metadata.xml
Downloaded: https://repository.apache.org/content/repositories/snapshots/org/apache/xmlgraphics/batik-ttf2svg/1.11.0-SNAPSHOT/maven-metadata.xml (791 B at 1.9 KB/sec)
[INFO]
[INFO] --- maven-clean-plugin:2.4.1:clean (default-clean) @ fop-servlet ---
[INFO] Deleting <https://builds.apache.org/job/xmlgraphics-fop/ws/fop-servlet/target>
[INFO]
[INFO] --- maven-resources-plugin:2.5:resources (default-resources) @ fop-servlet ---
[debug] execute contextualize
[INFO] Using 'UTF-8' encoding to copy filtered resources.
[INFO] skip non existing resourceDirectory <https://builds.apache.org/job/xmlgraphics-fop/ws/fop-servlet/src/main/resources>
[INFO]
[INFO] --- maven-compiler-plugin:3.1:compile (default-compile) @ fop-servlet ---
[INFO] No sources to compile
[INFO]
[INFO] --- maven-resources-plugin:2.5:testResources (default-testResources) @ fop-servlet ---
[debug] execute contextualize
[INFO] Using 'UTF-8' encoding to copy filtered resources.
[INFO] skip non existing resourceDirectory <https://builds.apache.org/job/xmlgraphics-fop/ws/fop-servlet/src/test/resources>
[INFO]
[INFO] --- maven-compiler-plugin:3.1:testCompile (default-testCompile) @ fop-servlet ---
[INFO] No sources to compile
[INFO]
[INFO] --- maven-surefire-plugin:2.18.1:test (default-test) @ fop-servlet ---
[INFO] No tests to run.
[JENKINS] Recording test results
[INFO]
[INFO] --- maven-war-plugin:2.2:war (default-war) @ fop-servlet ---
[INFO] Packaging webapp
[INFO] Assembling webapp [fop-servlet] in [<https://builds.apache.org/job/xmlgraphics-fop/ws/fop-servlet/target/fop-servlet-2.4.0-SNAPSHOT]>
[INFO] Processing war project
[INFO] Copying webapp resources [<https://builds.apache.org/job/xmlgraphics-fop/ws/fop-servlet/src/main/webapp]>
[INFO] Webapp assembled in [94 msecs]
[INFO] Building war: <https://builds.apache.org/job/xmlgraphics-fop/ws/fop-servlet/target/fop-servlet-2.4.0-SNAPSHOT.war>
[INFO]
[INFO] --- maven-install-plugin:2.3.1:install (default-install) @ fop-servlet ---
[INFO] Installing <https://builds.apache.org/job/xmlgraphics-fop/ws/fop-servlet/target/fop-servlet-2.4.0-SNAPSHOT.war> to /home/jenkins/jenkins-slave/maven-repositories/1/org/apache/xmlgraphics/fop-servlet/2.4.0-SNAPSHOT/fop-servlet-2.4.0-SNAPSHOT.war
[INFO] Installing <https://builds.apache.org/job/xmlgraphics-fop/ws/fop-servlet/pom.xml> to /home/jenkins/jenkins-slave/maven-repositories/1/org/apache/xmlgraphics/fop-servlet/2.4.0-SNAPSHOT/fop-servlet-2.4.0-SNAPSHOT.pom
[INFO]
[INFO] --- maven-checkstyle-plugin:2.14:checkstyle (default-cli) @ fop-servlet ---
[CHECKSTYLE] No report found for mojo checkstyle
[INFO]
[INFO] --- findbugs-maven-plugin:3.0.5:findbugs (default-cli) @ fop-servlet ---
[FINDBUGS] No report found for mojo findbugs
[INFO]                                                                        
[INFO] ------------------------------------------------------------------------
[INFO] Building Apache FOP Transcoder 2.4.0-SNAPSHOT
[INFO] ------------------------------------------------------------------------
[INFO]
[INFO] --- maven-clean-plugin:2.4.1:clean (default-clean) @ fop-transcoder ---
[INFO] Deleting <https://builds.apache.org/job/xmlgraphics-fop/ws/fop-transcoder/target>
[INFO]
[INFO] --- maven-resources-plugin:2.5:resources (default-resources) @ fop-transcoder ---
[debug] execute contextualize
[INFO] Using 'UTF-8' encoding to copy filtered resources.
[INFO] skip non existing resourceDirectory <https://builds.apache.org/job/xmlgraphics-fop/ws/fop-transcoder/src/main/resources>
[INFO]
[INFO] --- maven-compiler-plugin:3.1:compile (default-compile) @ fop-transcoder ---
[INFO] No sources to compile
[INFO]
[INFO] --- maven-resources-plugin:2.5:testResources (default-testResources) @ fop-transcoder ---
[debug] execute contextualize
[INFO] Using 'UTF-8' encoding to copy filtered resources.
[INFO] skip non existing resourceDirectory <https://builds.apache.org/job/xmlgraphics-fop/ws/fop-transcoder/src/test/resources>
[INFO]
[INFO] --- maven-compiler-plugin:3.1:testCompile (default-testCompile) @ fop-transcoder ---
[INFO] No sources to compile
[INFO]
[INFO] --- maven-surefire-plugin:2.18.1:test (default-test) @ fop-transcoder ---
[INFO] No tests to run.
[JENKINS] Recording test results
[INFO]
[INFO] --- maven-jar-plugin:3.1.1:jar (default-jar) @ fop-transcoder ---
[WARNING] JAR will be empty - no content was marked for inclusion!
[INFO] Building jar: <https://builds.apache.org/job/xmlgraphics-fop/ws/fop-transcoder/target/fop-transcoder-2.4.0-SNAPSHOT.jar>
[INFO]
[INFO] --- maven-assembly-plugin:2.2-beta-5:single (package-all) @ fop-transcoder ---
[INFO] Reading assembly descriptor: src/tools/resources/assembly/assembly.xml
[WARNING] Artifact: org.apache.xmlgraphics:fop-transcoder:jar:2.4.0-SNAPSHOT references the same file as the assembly destination file. Moving it to a temporary location for inclusion.
[INFO] Building jar: <https://builds.apache.org/job/xmlgraphics-fop/ws/fop-transcoder/target/fop-transcoder-2.4.0-SNAPSHOT.jar>
[WARNING] Configuration options: 'appendAssemblyId' is set to false, and 'classifier' is missing.
Instead of attaching the assembly file: <https://builds.apache.org/job/xmlgraphics-fop/ws/fop-transcoder/target/fop-transcoder-2.4.0-SNAPSHOT.jar,> it will become the file for main project artifact.
NOTE: If multiple descriptors or descriptor-formats are provided for this project, the value of this file will be non-deterministic!
[WARNING] Replacing pre-existing project main-artifact file: <https://builds.apache.org/job/xmlgraphics-fop/ws/fop-transcoder/target/archive-tmp/fop-transcoder-2.4.0-SNAPSHOT.jar>
with assembly file: <https://builds.apache.org/job/xmlgraphics-fop/ws/fop-transcoder/target/fop-transcoder-2.4.0-SNAPSHOT.jar>
[INFO]
[INFO] --- maven-install-plugin:2.3.1:install (default-install) @ fop-transcoder ---
[INFO] Installing <https://builds.apache.org/job/xmlgraphics-fop/ws/fop-transcoder/target/fop-transcoder-2.4.0-SNAPSHOT.jar> to /home/jenkins/jenkins-slave/maven-repositories/1/org/apache/xmlgraphics/fop-transcoder/2.4.0-SNAPSHOT/fop-transcoder-2.4.0-SNAPSHOT.jar
[INFO] Installing <https://builds.apache.org/job/xmlgraphics-fop/ws/fop-transcoder/pom.xml> to /home/jenkins/jenkins-slave/maven-repositories/1/org/apache/xmlgraphics/fop-transcoder/2.4.0-SNAPSHOT/fop-transcoder-2.4.0-SNAPSHOT.pom
[INFO]
[INFO] --- maven-checkstyle-plugin:2.14:checkstyle (default-cli) @ fop-transcoder ---
[CHECKSTYLE] No report found for mojo checkstyle
[INFO]
[INFO] --- findbugs-maven-plugin:3.0.5:findbugs (default-cli) @ fop-transcoder ---
[FINDBUGS] No report found for mojo findbugs
[INFO]                                                                        
[INFO] ------------------------------------------------------------------------
[INFO] Building Apache FOP Transcoder All-In-One 2.4.0-SNAPSHOT
[INFO] ------------------------------------------------------------------------
[INFO]
[INFO] --- maven-clean-plugin:2.4.1:clean (default-clean) @ fop-transcoder-allinone ---
[INFO] Deleting <https://builds.apache.org/job/xmlgraphics-fop/ws/fop-transcoder-allinone/target>
[INFO]
[INFO] --- maven-resources-plugin:2.5:resources (default-resources) @ fop-transcoder-allinone ---
[debug] execute contextualize
[INFO] Using 'UTF-8' encoding to copy filtered resources.
[INFO] skip non existing resourceDirectory <https://builds.apache.org/job/xmlgraphics-fop/ws/fop-transcoder-allinone/src/main/resources>
[INFO]
[INFO] --- maven-compiler-plugin:3.1:compile (default-compile) @ fop-transcoder-allinone ---
[INFO] No sources to compile
[INFO]
[INFO] --- maven-resources-plugin:2.5:testResources (default-testResources) @ fop-transcoder-allinone ---
[debug] execute contextualize
[INFO] Using 'UTF-8' encoding to copy filtered resources.
[INFO] skip non existing resourceDirectory <https://builds.apache.org/job/xmlgraphics-fop/ws/fop-transcoder-allinone/src/test/resources>
[INFO]
[INFO] --- maven-compiler-plugin:3.1:testCompile (default-testCompile) @ fop-transcoder-allinone ---
[INFO] No sources to compile
[INFO]
[INFO] --- maven-surefire-plugin:2.18.1:test (default-test) @ fop-transcoder-allinone ---
[INFO] No tests to run.
[JENKINS] Recording test results
[INFO]
[INFO] --- maven-jar-plugin:3.1.1:jar (default-jar) @ fop-transcoder-allinone ---
[WARNING] JAR will be empty - no content was marked for inclusion!
[INFO] Building jar: <https://builds.apache.org/job/xmlgraphics-fop/ws/fop-transcoder-allinone/target/fop-transcoder-allinone-2.4.0-SNAPSHOT.jar>
[INFO]
[INFO] --- maven-assembly-plugin:2.2-beta-5:single (package-all) @ fop-transcoder-allinone ---
[INFO] Reading assembly descriptor: src/tools/resources/assembly/assembly.xml
[WARNING] Artifact: org.apache.xmlgraphics:fop-transcoder-allinone:jar:2.4.0-SNAPSHOT references the same file as the assembly destination file. Moving it to a temporary location for inclusion.
[INFO] Building jar: <https://builds.apache.org/job/xmlgraphics-fop/ws/fop-transcoder-allinone/target/fop-transcoder-allinone-2.4.0-SNAPSHOT.jar>
[WARNING] Configuration options: 'appendAssemblyId' is set to false, and 'classifier' is missing.
Instead of attaching the assembly file: <https://builds.apache.org/job/xmlgraphics-fop/ws/fop-transcoder-allinone/target/fop-transcoder-allinone-2.4.0-SNAPSHOT.jar,> it will become the file for main project artifact.
NOTE: If multiple descriptors or descriptor-formats are provided for this project, the value of this file will be non-deterministic!
[WARNING] Replacing pre-existing project main-artifact file: <https://builds.apache.org/job/xmlgraphics-fop/ws/fop-transcoder-allinone/target/archive-tmp/fop-transcoder-allinone-2.4.0-SNAPSHOT.jar>
with assembly file: <https://builds.apache.org/job/xmlgraphics-fop/ws/fop-transcoder-allinone/target/fop-transcoder-allinone-2.4.0-SNAPSHOT.jar>
[INFO]
[INFO] --- maven-install-plugin:2.3.1:install (default-install) @ fop-transcoder-allinone ---
[INFO] Installing <https://builds.apache.org/job/xmlgraphics-fop/ws/fop-transcoder-allinone/target/fop-transcoder-allinone-2.4.0-SNAPSHOT.jar> to /home/jenkins/jenkins-slave/maven-repositories/1/org/apache/xmlgraphics/fop-transcoder-allinone/2.4.0-SNAPSHOT/fop-transcoder-allinone-2.4.0-SNAPSHOT.jar
[INFO] Installing <https://builds.apache.org/job/xmlgraphics-fop/ws/fop-transcoder-allinone/pom.xml> to /home/jenkins/jenkins-slave/maven-repositories/1/org/apache/xmlgraphics/fop-transcoder-allinone/2.4.0-SNAPSHOT/fop-transcoder-allinone-2.4.0-SNAPSHOT.pom
[INFO]
[INFO] --- maven-checkstyle-plugin:2.14:checkstyle (default-cli) @ fop-transcoder-allinone ---
[CHECKSTYLE] No report found for mojo checkstyle
[INFO]
[INFO] --- findbugs-maven-plugin:3.0.5:findbugs (default-cli) @ fop-transcoder-allinone ---
[FINDBUGS] No report found for mojo findbugs
[INFO] ------------------------------------------------------------------------
[INFO] Reactor Summary:
[INFO]
[INFO] Apache FOP Parent ................................. SUCCESS [13.667s]
[INFO] Apache FOP Utilities .............................. SUCCESS [2:35.749s]
[INFO] Apache FOP Events ................................. SUCCESS [21.976s]
[INFO] Apache FOP Core ................................... SUCCESS [4:32.124s]
[INFO] Apache FOP All-In-One ............................. SUCCESS [5.401s]
[INFO] Apache FOP Sandbox ................................ SUCCESS [14.780s]
[INFO] Apache FOP Servlet ................................ SUCCESS [10.185s]
[INFO] Apache FOP Transcoder ............................. SUCCESS [4.394s]
[INFO] Apache FOP Transcoder All-In-One .................. SUCCESS [10.202s]
[INFO] ------------------------------------------------------------------------
[INFO] BUILD SUCCESS
[INFO] ------------------------------------------------------------------------
[INFO] Total time: 9:03.249s
[INFO] Finished at: Thu Apr 04 13:07:07 UTC 2019
[INFO] Final Memory: 88M/4052M
[INFO] ------------------------------------------------------------------------
Waiting for Jenkins to finish collecting data
[JENKINS] Archiving <https://builds.apache.org/job/xmlgraphics-fop/ws/fop-sandbox/pom.xml> to org.apache.xmlgraphics/fop-sandbox/2.4.0-SNAPSHOT/fop-sandbox-2.4.0-SNAPSHOT.pom
[JENKINS] Archiving <https://builds.apache.org/job/xmlgraphics-fop/ws/fop-sandbox/target/fop-sandbox-2.4.0-SNAPSHOT.jar> to org.apache.xmlgraphics/fop-sandbox/2.4.0-SNAPSHOT/fop-sandbox-2.4.0-SNAPSHOT.jar
[JENKINS] Archiving <https://builds.apache.org/job/xmlgraphics-fop/ws/pom.xml> to org.apache.xmlgraphics/fop-parent/2.4.0-SNAPSHOT/fop-parent-2.4.0-SNAPSHOT.pom
[JENKINS] Archiving <https://builds.apache.org/job/xmlgraphics-fop/ws/fop-core/pom.xml> to org.apache.xmlgraphics/fop-core/2.4.0-SNAPSHOT/fop-core-2.4.0-SNAPSHOT.pom
[JENKINS] Archiving <https://builds.apache.org/job/xmlgraphics-fop/ws/fop-core/target/fop-core-2.4.0-SNAPSHOT.jar> to org.apache.xmlgraphics/fop-core/2.4.0-SNAPSHOT/fop-core-2.4.0-SNAPSHOT.jar
[JENKINS] Archiving <https://builds.apache.org/job/xmlgraphics-fop/ws/fop/pom.xml> to org.apache.xmlgraphics/fop/2.4.0-SNAPSHOT/fop-2.4.0-SNAPSHOT.pom
[JENKINS] Archiving <https://builds.apache.org/job/xmlgraphics-fop/ws/fop/target/fop-2.4.0-SNAPSHOT.jar> to org.apache.xmlgraphics/fop/2.4.0-SNAPSHOT/fop-2.4.0-SNAPSHOT.jar
[JENKINS] Archiving <https://builds.apache.org/job/xmlgraphics-fop/ws/fop-servlet/pom.xml> to org.apache.xmlgraphics/fop-servlet/2.4.0-SNAPSHOT/fop-servlet-2.4.0-SNAPSHOT.pom
[JENKINS] Archiving <https://builds.apache.org/job/xmlgraphics-fop/ws/fop-servlet/target/fop-servlet-2.4.0-SNAPSHOT.war> to org.apache.xmlgraphics/fop-servlet/2.4.0-SNAPSHOT/fop-servlet-2.4.0-SNAPSHOT.war
[Fast Archiver] Compressed 8.20 MB of artifacts by 45.4% relative to #244
[JENKINS] Archiving <https://builds.apache.org/job/xmlgraphics-fop/ws/fop-transcoder-allinone/pom.xml> to org.apache.xmlgraphics/fop-transcoder-allinone/2.4.0-SNAPSHOT/fop-transcoder-allinone-2.4.0-SNAPSHOT.pom
[JENKINS] Archiving <https://builds.apache.org/job/xmlgraphics-fop/ws/fop-transcoder-allinone/target/fop-transcoder-allinone-2.4.0-SNAPSHOT.jar> to org.apache.xmlgraphics/fop-transcoder-allinone/2.4.0-SNAPSHOT/fop-transcoder-allinone-2.4.0-SNAPSHOT.jar
[JENKINS] Archiving <https://builds.apache.org/job/xmlgraphics-fop/ws/fop-util/pom.xml> to org.apache.xmlgraphics/fop-util/2.4.0-SNAPSHOT/fop-util-2.4.0-SNAPSHOT.pom
[JENKINS] Archiving <https://builds.apache.org/job/xmlgraphics-fop/ws/fop-util/target/fop-util-2.4.0-SNAPSHOT.jar> to org.apache.xmlgraphics/fop-util/2.4.0-SNAPSHOT/fop-util-2.4.0-SNAPSHOT.jar
[JENKINS] Archiving <https://builds.apache.org/job/xmlgraphics-fop/ws/fop-events/pom.xml> to org.apache.xmlgraphics/fop-events/2.4.0-SNAPSHOT/fop-events-2.4.0-SNAPSHOT.pom
[JENKINS] Archiving <https://builds.apache.org/job/xmlgraphics-fop/ws/fop-events/target/fop-events-2.4.0-SNAPSHOT.jar> to org.apache.xmlgraphics/fop-events/2.4.0-SNAPSHOT/fop-events-2.4.0-SNAPSHOT.jar
[JENKINS] Archiving <https://builds.apache.org/job/xmlgraphics-fop/ws/fop-transcoder/pom.xml> to org.apache.xmlgraphics/fop-transcoder/2.4.0-SNAPSHOT/fop-transcoder-2.4.0-SNAPSHOT.pom
[JENKINS] Archiving <https://builds.apache.org/job/xmlgraphics-fop/ws/fop-transcoder/target/fop-transcoder-2.4.0-SNAPSHOT.jar> to org.apache.xmlgraphics/fop-transcoder/2.4.0-SNAPSHOT/fop-transcoder-2.4.0-SNAPSHOT.jar
[CHECKSTYLE] Plug-in Result: Success - no threshold has been exceeded
[CHECKSTYLE] Plug-in Result: Success - no threshold has been exceeded
[CHECKSTYLE] Plug-in Result: Success - no threshold has been exceeded
[FINDBUGS] Plug-in Result: Success - no threshold has been exceeded
[FINDBUGS] Plug-in Result: Success - no threshold has been exceeded
[FINDBUGS] Plug-in Result: Failed - <a href="findbugsResult">2 warnings</a> exceed the threshold of 1 by 1
[FINDBUGS] Plug-in Result: Failed - <a href="findbugsResult">2 warnings</a> exceed the threshold of 1 by 1
channel stopped
Reply | Threaded
Open this post in threaded view
|

Jenkins build is back to normal : xmlgraphics-fop #246

Apache Jenkins Server