Build failed in Jenkins: xmlgraphics-fop #216

classic Classic list List threaded Threaded
7 messages Options
Reply | Threaded
Open this post in threaded view
|

Build failed in Jenkins: xmlgraphics-fop #216

Apache Jenkins Server
See <https://builds.apache.org/job/xmlgraphics-fop/216/display/redirect?page=changes>

Changes:

[matthias] FOP-2818: fix color spaces getting lost of pdf images

------------------------------------------
[...truncated 112.25 KB...]
Downloading: https://repository.apache.org/content/repositories/snapshots/org/apache/xmlgraphics/batik-ttf2svg/1.11.0-SNAPSHOT/maven-metadata.xml
Downloading: https://repository.jboss.org/nexus/content/repositories/thirdparty-releases/org/apache/xmlgraphics/batik-ttf2svg/1.11.0-SNAPSHOT/maven-metadata.xml
[WARNING] Could not transfer metadata org.apache.xmlgraphics:batik-ttf2svg:1.11.0-SNAPSHOT/maven-metadata.xml from/to apache.snapshots.https (https://repository.apache.org/content/repositories/snapshots): Not authorized, ReasonPhrase:Unauthorized.
[INFO]
[INFO] --- maven-clean-plugin:2.4.1:clean (default-clean) @ fop-servlet ---
[INFO] Deleting <https://builds.apache.org/job/xmlgraphics-fop/ws/fop-servlet/target>
[INFO]
[INFO] --- maven-resources-plugin:2.5:resources (default-resources) @ fop-servlet ---
[debug] execute contextualize
[INFO] Using 'UTF-8' encoding to copy filtered resources.
[INFO] skip non existing resourceDirectory <https://builds.apache.org/job/xmlgraphics-fop/ws/fop-servlet/src/main/resources>
[INFO]
[INFO] --- maven-compiler-plugin:3.1:compile (default-compile) @ fop-servlet ---
[INFO] No sources to compile
[INFO]
[INFO] --- maven-resources-plugin:2.5:testResources (default-testResources) @ fop-servlet ---
[debug] execute contextualize
[INFO] Using 'UTF-8' encoding to copy filtered resources.
[INFO] skip non existing resourceDirectory <https://builds.apache.org/job/xmlgraphics-fop/ws/fop-servlet/src/test/resources>
[INFO]
[INFO] --- maven-compiler-plugin:3.1:testCompile (default-testCompile) @ fop-servlet ---
[INFO] No sources to compile
[INFO]
[INFO] --- maven-surefire-plugin:2.18.1:test (default-test) @ fop-servlet ---
[INFO] No tests to run.
[JENKINS] Recording test results
[INFO]
[INFO] --- maven-war-plugin:2.2:war (default-war) @ fop-servlet ---
[INFO] Packaging webapp
[INFO] Assembling webapp [fop-servlet] in [<https://builds.apache.org/job/xmlgraphics-fop/ws/fop-servlet/target/fop-servlet-2.4.0-SNAPSHOT]>
[INFO] Processing war project
[INFO] Copying webapp resources [<https://builds.apache.org/job/xmlgraphics-fop/ws/fop-servlet/src/main/webapp]>
[INFO] Webapp assembled in [136 msecs]
[INFO] Building war: <https://builds.apache.org/job/xmlgraphics-fop/ws/fop-servlet/target/fop-servlet-2.4.0-SNAPSHOT.war>
[INFO]
[INFO] --- maven-install-plugin:2.3.1:install (default-install) @ fop-servlet ---
[INFO] Installing <https://builds.apache.org/job/xmlgraphics-fop/ws/fop-servlet/target/fop-servlet-2.4.0-SNAPSHOT.war> to /home/jenkins/jenkins-slave/maven-repositories/0/org/apache/xmlgraphics/fop-servlet/2.4.0-SNAPSHOT/fop-servlet-2.4.0-SNAPSHOT.war
[INFO] Installing <https://builds.apache.org/job/xmlgraphics-fop/ws/fop-servlet/pom.xml> to /home/jenkins/jenkins-slave/maven-repositories/0/org/apache/xmlgraphics/fop-servlet/2.4.0-SNAPSHOT/fop-servlet-2.4.0-SNAPSHOT.pom
[INFO]
[INFO] --- maven-checkstyle-plugin:2.14:checkstyle (default-cli) @ fop-servlet ---
[CHECKSTYLE] No report found for mojo checkstyle
[INFO]
[INFO] --- findbugs-maven-plugin:3.0.5:findbugs (default-cli) @ fop-servlet ---
[FINDBUGS] No report found for mojo findbugs
[INFO]                                                                        
[INFO] ------------------------------------------------------------------------
[INFO] Building Apache FOP Transcoder 2.4.0-SNAPSHOT
[INFO] ------------------------------------------------------------------------
[INFO]
[INFO] --- maven-clean-plugin:2.4.1:clean (default-clean) @ fop-transcoder ---
[INFO] Deleting <https://builds.apache.org/job/xmlgraphics-fop/ws/fop-transcoder/target>
[INFO]
[INFO] --- maven-resources-plugin:2.5:resources (default-resources) @ fop-transcoder ---
[debug] execute contextualize
[INFO] Using 'UTF-8' encoding to copy filtered resources.
[INFO] skip non existing resourceDirectory <https://builds.apache.org/job/xmlgraphics-fop/ws/fop-transcoder/src/main/resources>
[INFO]
[INFO] --- maven-compiler-plugin:3.1:compile (default-compile) @ fop-transcoder ---
[INFO] No sources to compile
[INFO]
[INFO] --- maven-resources-plugin:2.5:testResources (default-testResources) @ fop-transcoder ---
[debug] execute contextualize
[INFO] Using 'UTF-8' encoding to copy filtered resources.
[INFO] skip non existing resourceDirectory <https://builds.apache.org/job/xmlgraphics-fop/ws/fop-transcoder/src/test/resources>
[INFO]
[INFO] --- maven-compiler-plugin:3.1:testCompile (default-testCompile) @ fop-transcoder ---
[INFO] No sources to compile
[INFO]
[INFO] --- maven-surefire-plugin:2.18.1:test (default-test) @ fop-transcoder ---
[INFO] No tests to run.
[JENKINS] Recording test results
[INFO]
[INFO] --- maven-jar-plugin:2.6:jar (default-jar) @ fop-transcoder ---
[WARNING] JAR will be empty - no content was marked for inclusion!
[INFO] Building jar: <https://builds.apache.org/job/xmlgraphics-fop/ws/fop-transcoder/target/fop-transcoder-2.4.0-SNAPSHOT.jar>
[INFO]
[INFO] --- maven-assembly-plugin:2.2-beta-5:single (package-all) @ fop-transcoder ---
[INFO] Reading assembly descriptor: src/tools/resources/assembly/assembly.xml
[WARNING] Artifact: org.apache.xmlgraphics:fop-transcoder:jar:2.4.0-SNAPSHOT references the same file as the assembly destination file. Moving it to a temporary location for inclusion.
[INFO] Building jar: <https://builds.apache.org/job/xmlgraphics-fop/ws/fop-transcoder/target/fop-transcoder-2.4.0-SNAPSHOT.jar>
[WARNING] Configuration options: 'appendAssemblyId' is set to false, and 'classifier' is missing.
Instead of attaching the assembly file: <https://builds.apache.org/job/xmlgraphics-fop/ws/fop-transcoder/target/fop-transcoder-2.4.0-SNAPSHOT.jar,> it will become the file for main project artifact.
NOTE: If multiple descriptors or descriptor-formats are provided for this project, the value of this file will be non-deterministic!
[WARNING] Replacing pre-existing project main-artifact file: <https://builds.apache.org/job/xmlgraphics-fop/ws/fop-transcoder/target/archive-tmp/fop-transcoder-2.4.0-SNAPSHOT.jar>
with assembly file: <https://builds.apache.org/job/xmlgraphics-fop/ws/fop-transcoder/target/fop-transcoder-2.4.0-SNAPSHOT.jar>
[INFO]
[INFO] --- maven-install-plugin:2.3.1:install (default-install) @ fop-transcoder ---
[INFO] Installing <https://builds.apache.org/job/xmlgraphics-fop/ws/fop-transcoder/target/fop-transcoder-2.4.0-SNAPSHOT.jar> to /home/jenkins/jenkins-slave/maven-repositories/0/org/apache/xmlgraphics/fop-transcoder/2.4.0-SNAPSHOT/fop-transcoder-2.4.0-SNAPSHOT.jar
[INFO] Installing <https://builds.apache.org/job/xmlgraphics-fop/ws/fop-transcoder/pom.xml> to /home/jenkins/jenkins-slave/maven-repositories/0/org/apache/xmlgraphics/fop-transcoder/2.4.0-SNAPSHOT/fop-transcoder-2.4.0-SNAPSHOT.pom
[INFO]
[INFO] --- maven-checkstyle-plugin:2.14:checkstyle (default-cli) @ fop-transcoder ---
[CHECKSTYLE] No report found for mojo checkstyle
[INFO]
[INFO] --- findbugs-maven-plugin:3.0.5:findbugs (default-cli) @ fop-transcoder ---
[FINDBUGS] No report found for mojo findbugs
[INFO]                                                                        
[INFO] ------------------------------------------------------------------------
[INFO] Building Apache FOP Transcoder All-In-One 2.4.0-SNAPSHOT
[INFO] ------------------------------------------------------------------------
[INFO]
[INFO] --- maven-clean-plugin:2.4.1:clean (default-clean) @ fop-transcoder-allinone ---
[INFO] Deleting <https://builds.apache.org/job/xmlgraphics-fop/ws/fop-transcoder-allinone/target>
[INFO]
[INFO] --- maven-resources-plugin:2.5:resources (default-resources) @ fop-transcoder-allinone ---
[debug] execute contextualize
[INFO] Using 'UTF-8' encoding to copy filtered resources.
[INFO] skip non existing resourceDirectory <https://builds.apache.org/job/xmlgraphics-fop/ws/fop-transcoder-allinone/src/main/resources>
[INFO]
[INFO] --- maven-compiler-plugin:3.1:compile (default-compile) @ fop-transcoder-allinone ---
[INFO] No sources to compile
[INFO]
[INFO] --- maven-resources-plugin:2.5:testResources (default-testResources) @ fop-transcoder-allinone ---
[debug] execute contextualize
[INFO] Using 'UTF-8' encoding to copy filtered resources.
[INFO] skip non existing resourceDirectory <https://builds.apache.org/job/xmlgraphics-fop/ws/fop-transcoder-allinone/src/test/resources>
[INFO]
[INFO] --- maven-compiler-plugin:3.1:testCompile (default-testCompile) @ fop-transcoder-allinone ---
[INFO] No sources to compile
[INFO]
[INFO] --- maven-surefire-plugin:2.18.1:test (default-test) @ fop-transcoder-allinone ---
[INFO] No tests to run.
[JENKINS] Recording test results
[INFO]
[INFO] --- maven-jar-plugin:2.6:jar (default-jar) @ fop-transcoder-allinone ---
[WARNING] JAR will be empty - no content was marked for inclusion!
[INFO] Building jar: <https://builds.apache.org/job/xmlgraphics-fop/ws/fop-transcoder-allinone/target/fop-transcoder-allinone-2.4.0-SNAPSHOT.jar>
[INFO]
[INFO] --- maven-assembly-plugin:2.2-beta-5:single (package-all) @ fop-transcoder-allinone ---
[INFO] Reading assembly descriptor: src/tools/resources/assembly/assembly.xml
[WARNING] Artifact: org.apache.xmlgraphics:fop-transcoder-allinone:jar:2.4.0-SNAPSHOT references the same file as the assembly destination file. Moving it to a temporary location for inclusion.
[INFO] org/apache/avalon/framework/component/ already added, skipping
[INFO] org/apache/avalon/framework/configuration/ already added, skipping
[INFO] org/apache/avalon/framework/context/ already added, skipping
[INFO] org/apache/avalon/framework/logger/ already added, skipping
[INFO] org/apache/avalon/framework/service/ already added, skipping
[INFO] Building jar: <https://builds.apache.org/job/xmlgraphics-fop/ws/fop-transcoder-allinone/target/fop-transcoder-allinone-2.4.0-SNAPSHOT.jar>
[INFO] org/apache/avalon/framework/component/ already added, skipping
[INFO] org/apache/avalon/framework/configuration/ already added, skipping
[INFO] org/apache/avalon/framework/context/ already added, skipping
[INFO] org/apache/avalon/framework/logger/ already added, skipping
[INFO] org/apache/avalon/framework/service/ already added, skipping
[WARNING] Configuration options: 'appendAssemblyId' is set to false, and 'classifier' is missing.
Instead of attaching the assembly file: <https://builds.apache.org/job/xmlgraphics-fop/ws/fop-transcoder-allinone/target/fop-transcoder-allinone-2.4.0-SNAPSHOT.jar,> it will become the file for main project artifact.
NOTE: If multiple descriptors or descriptor-formats are provided for this project, the value of this file will be non-deterministic!
[WARNING] Replacing pre-existing project main-artifact file: <https://builds.apache.org/job/xmlgraphics-fop/ws/fop-transcoder-allinone/target/archive-tmp/fop-transcoder-allinone-2.4.0-SNAPSHOT.jar>
with assembly file: <https://builds.apache.org/job/xmlgraphics-fop/ws/fop-transcoder-allinone/target/fop-transcoder-allinone-2.4.0-SNAPSHOT.jar>
[INFO]
[INFO] --- maven-install-plugin:2.3.1:install (default-install) @ fop-transcoder-allinone ---
[INFO] Installing <https://builds.apache.org/job/xmlgraphics-fop/ws/fop-transcoder-allinone/target/fop-transcoder-allinone-2.4.0-SNAPSHOT.jar> to /home/jenkins/jenkins-slave/maven-repositories/0/org/apache/xmlgraphics/fop-transcoder-allinone/2.4.0-SNAPSHOT/fop-transcoder-allinone-2.4.0-SNAPSHOT.jar
[INFO] Installing <https://builds.apache.org/job/xmlgraphics-fop/ws/fop-transcoder-allinone/pom.xml> to /home/jenkins/jenkins-slave/maven-repositories/0/org/apache/xmlgraphics/fop-transcoder-allinone/2.4.0-SNAPSHOT/fop-transcoder-allinone-2.4.0-SNAPSHOT.pom
[INFO]
[INFO] --- maven-checkstyle-plugin:2.14:checkstyle (default-cli) @ fop-transcoder-allinone ---
[CHECKSTYLE] No report found for mojo checkstyle
[INFO]
[INFO] --- findbugs-maven-plugin:3.0.5:findbugs (default-cli) @ fop-transcoder-allinone ---
[FINDBUGS] No report found for mojo findbugs
[INFO] ------------------------------------------------------------------------
[INFO] Reactor Summary:
[INFO]
[INFO] Apache FOP Parent ................................. SUCCESS [17.664s]
[INFO] Apache FOP Utilities .............................. SUCCESS [2:19.903s]
[INFO] Apache FOP Events ................................. SUCCESS [20.857s]
[INFO] Apache FOP Core ................................... SUCCESS [3:58.887s]
[INFO] Apache FOP All-In-One ............................. SUCCESS [6.506s]
[INFO] Apache FOP Sandbox ................................ SUCCESS [13.052s]
[INFO] Apache FOP Servlet ................................ SUCCESS [14.158s]
[INFO] Apache FOP Transcoder ............................. SUCCESS [4.884s]
[INFO] Apache FOP Transcoder All-In-One .................. SUCCESS [4.544s]
[INFO] ------------------------------------------------------------------------
[INFO] BUILD SUCCESS
[INFO] ------------------------------------------------------------------------
[INFO] Total time: 8:16.148s
[INFO] Finished at: Tue Oct 09 16:02:50 UTC 2018
[INFO] Final Memory: 82M/4051M
[INFO] ------------------------------------------------------------------------
Waiting for Jenkins to finish collecting data
[JENKINS] Archiving <https://builds.apache.org/job/xmlgraphics-fop/ws/fop-sandbox/pom.xml> to org.apache.xmlgraphics/fop-sandbox/2.4.0-SNAPSHOT/fop-sandbox-2.4.0-SNAPSHOT.pom
[JENKINS] Archiving <https://builds.apache.org/job/xmlgraphics-fop/ws/fop-sandbox/target/fop-sandbox-2.4.0-SNAPSHOT.jar> to org.apache.xmlgraphics/fop-sandbox/2.4.0-SNAPSHOT/fop-sandbox-2.4.0-SNAPSHOT.jar
[JENKINS] Archiving <https://builds.apache.org/job/xmlgraphics-fop/ws/pom.xml> to org.apache.xmlgraphics/fop-parent/2.4.0-SNAPSHOT/fop-parent-2.4.0-SNAPSHOT.pom
[JENKINS] Archiving <https://builds.apache.org/job/xmlgraphics-fop/ws/fop-core/pom.xml> to org.apache.xmlgraphics/fop-core/2.4.0-SNAPSHOT/fop-core-2.4.0-SNAPSHOT.pom
[JENKINS] Archiving <https://builds.apache.org/job/xmlgraphics-fop/ws/fop-core/target/fop-core-2.4.0-SNAPSHOT.jar> to org.apache.xmlgraphics/fop-core/2.4.0-SNAPSHOT/fop-core-2.4.0-SNAPSHOT.jar
[JENKINS] Archiving <https://builds.apache.org/job/xmlgraphics-fop/ws/fop/pom.xml> to org.apache.xmlgraphics/fop/2.4.0-SNAPSHOT/fop-2.4.0-SNAPSHOT.pom
[JENKINS] Archiving <https://builds.apache.org/job/xmlgraphics-fop/ws/fop/target/fop-2.4.0-SNAPSHOT.jar> to org.apache.xmlgraphics/fop/2.4.0-SNAPSHOT/fop-2.4.0-SNAPSHOT.jar
[JENKINS] Archiving <https://builds.apache.org/job/xmlgraphics-fop/ws/fop-servlet/pom.xml> to org.apache.xmlgraphics/fop-servlet/2.4.0-SNAPSHOT/fop-servlet-2.4.0-SNAPSHOT.pom
[JENKINS] Archiving <https://builds.apache.org/job/xmlgraphics-fop/ws/fop-servlet/target/fop-servlet-2.4.0-SNAPSHOT.war> to org.apache.xmlgraphics/fop-servlet/2.4.0-SNAPSHOT/fop-servlet-2.4.0-SNAPSHOT.war
[JENKINS] Archiving <https://builds.apache.org/job/xmlgraphics-fop/ws/fop-transcoder-allinone/pom.xml> to org.apache.xmlgraphics/fop-transcoder-allinone/2.4.0-SNAPSHOT/fop-transcoder-allinone-2.4.0-SNAPSHOT.pom
[JENKINS] Archiving <https://builds.apache.org/job/xmlgraphics-fop/ws/fop-transcoder-allinone/target/fop-transcoder-allinone-2.4.0-SNAPSHOT.jar> to org.apache.xmlgraphics/fop-transcoder-allinone/2.4.0-SNAPSHOT/fop-transcoder-allinone-2.4.0-SNAPSHOT.jar
[JENKINS] Archiving <https://builds.apache.org/job/xmlgraphics-fop/ws/fop-util/pom.xml> to org.apache.xmlgraphics/fop-util/2.4.0-SNAPSHOT/fop-util-2.4.0-SNAPSHOT.pom
[JENKINS] Archiving <https://builds.apache.org/job/xmlgraphics-fop/ws/fop-util/target/fop-util-2.4.0-SNAPSHOT.jar> to org.apache.xmlgraphics/fop-util/2.4.0-SNAPSHOT/fop-util-2.4.0-SNAPSHOT.jar
[JENKINS] Archiving <https://builds.apache.org/job/xmlgraphics-fop/ws/fop-events/pom.xml> to org.apache.xmlgraphics/fop-events/2.4.0-SNAPSHOT/fop-events-2.4.0-SNAPSHOT.pom
[JENKINS] Archiving <https://builds.apache.org/job/xmlgraphics-fop/ws/fop-events/target/fop-events-2.4.0-SNAPSHOT.jar> to org.apache.xmlgraphics/fop-events/2.4.0-SNAPSHOT/fop-events-2.4.0-SNAPSHOT.jar
[JENKINS] Archiving <https://builds.apache.org/job/xmlgraphics-fop/ws/fop-transcoder/pom.xml> to org.apache.xmlgraphics/fop-transcoder/2.4.0-SNAPSHOT/fop-transcoder-2.4.0-SNAPSHOT.pom
[JENKINS] Archiving <https://builds.apache.org/job/xmlgraphics-fop/ws/fop-transcoder/target/fop-transcoder-2.4.0-SNAPSHOT.jar> to org.apache.xmlgraphics/fop-transcoder/2.4.0-SNAPSHOT/fop-transcoder-2.4.0-SNAPSHOT.jar
[CHECKSTYLE] Plug-in Result: Success - no threshold has been exceeded
[CHECKSTYLE] Plug-in Result: Success - no threshold has been exceeded
[CHECKSTYLE] Plug-in Result: Success - no threshold has been exceeded
[CHECKSTYLE] Plug-in Result: Success - no threshold has been exceeded
[FINDBUGS] Plug-in Result: Success - no threshold has been exceeded
[FINDBUGS] Plug-in Result: Success - no threshold has been exceeded
[FINDBUGS] Plug-in Result: Success - no threshold has been exceeded
[FINDBUGS] Plug-in Result: Success - no threshold has been exceeded
channel stopped
Maven RedeployPublisher use remote ubuntu-1 maven settings from : /home/jenkins/.m2/settings.xml
[INFO] Deployment in https://repository.apache.org/content/repositories/snapshots (id=apache.snapshots.https,uniqueVersion=true)
Deploying the main artifact fop-2.4.0-SNAPSHOT.jar
Downloading: https://repository.apache.org/content/repositories/snapshots/org/apache/xmlgraphics/fop/2.4.0-SNAPSHOT/maven-metadata.xml
Downloaded: https://repository.apache.org/content/repositories/snapshots/org/apache/xmlgraphics/fop/2.4.0-SNAPSHOT/maven-metadata.xml (778 B at 0.9 KB/sec)
Uploading: https://repository.apache.org/content/repositories/snapshots/org/apache/xmlgraphics/fop/2.4.0-SNAPSHOT/fop-2.4.0-20181009.160321-12.jar
Uploading: https://repository.apache.org/content/repositories/snapshots/org/apache/xmlgraphics/fop/2.4.0-SNAPSHOT/fop-2.4.0-20181009.160321-12.pom
ERROR: Failed to deploy artifacts: Could not transfer artifact org.apache.xmlgraphics:fop:jar:2.4.0-20181009.160321-12 from/to apache.snapshots.https (https://repository.apache.org/content/repositories/snapshots): Failed to transfer file: https://repository.apache.org/content/repositories/snapshots/org/apache/xmlgraphics/fop/2.4.0-SNAPSHOT/fop-2.4.0-20181009.160321-12.jar. Return code is: 401, ReasonPhrase: Unauthorized.
org.apache.maven.artifact.deployer.ArtifactDeploymentException: Failed to deploy artifacts: Could not transfer artifact org.apache.xmlgraphics:fop:jar:2.4.0-20181009.160321-12 from/to apache.snapshots.https (https://repository.apache.org/content/repositories/snapshots): Failed to transfer file: https://repository.apache.org/content/repositories/snapshots/org/apache/xmlgraphics/fop/2.4.0-SNAPSHOT/fop-2.4.0-20181009.160321-12.jar. Return code is: 401, ReasonPhrase: Unauthorized.
        at org.apache.maven.artifact.deployer.DefaultArtifactDeployer.deploy(DefaultArtifactDeployer.java:143)
        at hudson.maven.reporters.MavenArtifactRecord.deploy(MavenArtifactRecord.java:193)
        at hudson.maven.RedeployPublisher.perform(RedeployPublisher.java:176)
        at hudson.tasks.BuildStepMonitor$1.perform(BuildStepMonitor.java:20)
        at hudson.model.AbstractBuild$AbstractBuildExecution.perform(AbstractBuild.java:744)
        at hudson.model.AbstractBuild$AbstractBuildExecution.performAllBuildSteps(AbstractBuild.java:690)
        at hudson.maven.MavenModuleSetBuild$MavenModuleSetBuildExecution.post2(MavenModuleSetBuild.java:1073)
        at hudson.model.AbstractBuild$AbstractBuildExecution.post(AbstractBuild.java:635)
        at hudson.model.Run.execute(Run.java:1819)
        at hudson.maven.MavenModuleSetBuild.run(MavenModuleSetBuild.java:543)
        at hudson.model.ResourceController.execute(ResourceController.java:97)
        at hudson.model.Executor.run(Executor.java:429)
Caused by: org.eclipse.aether.deployment.DeploymentException: Failed to deploy artifacts: Could not transfer artifact org.apache.xmlgraphics:fop:jar:2.4.0-20181009.160321-12 from/to apache.snapshots.https (https://repository.apache.org/content/repositories/snapshots): Failed to transfer file: https://repository.apache.org/content/repositories/snapshots/org/apache/xmlgraphics/fop/2.4.0-SNAPSHOT/fop-2.4.0-20181009.160321-12.jar. Return code is: 401, ReasonPhrase: Unauthorized.
        at org.eclipse.aether.internal.impl.DefaultDeployer.deploy(DefaultDeployer.java:317)
        at org.eclipse.aether.internal.impl.DefaultDeployer.deploy(DefaultDeployer.java:245)
        at org.eclipse.aether.internal.impl.DefaultRepositorySystem.deploy(DefaultRepositorySystem.java:420)
        at org.apache.maven.artifact.deployer.DefaultArtifactDeployer.deploy(DefaultArtifactDeployer.java:139)
        ... 11 more
Caused by: org.eclipse.aether.transfer.ArtifactTransferException: Could not transfer artifact org.apache.xmlgraphics:fop:jar:2.4.0-20181009.160321-12 from/to apache.snapshots.https (https://repository.apache.org/content/repositories/snapshots): Failed to transfer file: https://repository.apache.org/content/repositories/snapshots/org/apache/xmlgraphics/fop/2.4.0-SNAPSHOT/fop-2.4.0-20181009.160321-12.jar. Return code is: 401, ReasonPhrase: Unauthorized.
        at org.eclipse.aether.connector.basic.ArtifactTransportListener.transferFailed(ArtifactTransportListener.java:43)
        at org.eclipse.aether.connector.basic.BasicRepositoryConnector$TaskRunner.run(BasicRepositoryConnector.java:355)
        at org.eclipse.aether.connector.basic.BasicRepositoryConnector.put(BasicRepositoryConnector.java:274)
        at org.eclipse.aether.internal.impl.DefaultDeployer.deploy(DefaultDeployer.java:311)
        ... 14 more
Caused by: org.apache.maven.wagon.TransferFailedException: Failed to transfer file: https://repository.apache.org/content/repositories/snapshots/org/apache/xmlgraphics/fop/2.4.0-SNAPSHOT/fop-2.4.0-20181009.160321-12.jar. Return code is: 401, ReasonPhrase: Unauthorized.
        at org.apache.maven.wagon.shared.http.AbstractHttpClientWagon.put(AbstractHttpClientWagon.java:635)
        at org.apache.maven.wagon.shared.http.AbstractHttpClientWagon.put(AbstractHttpClientWagon.java:557)
        at org.apache.maven.wagon.shared.http.AbstractHttpClientWagon.put(AbstractHttpClientWagon.java:539)
        at org.apache.maven.wagon.shared.http.AbstractHttpClientWagon.put(AbstractHttpClientWagon.java:533)
        at org.apache.maven.wagon.shared.http.AbstractHttpClientWagon.put(AbstractHttpClientWagon.java:513)
        at org.eclipse.aether.transport.wagon.WagonTransporter$PutTaskRunner.run(WagonTransporter.java:644)
        at org.eclipse.aether.transport.wagon.WagonTransporter.execute(WagonTransporter.java:427)
        at org.eclipse.aether.transport.wagon.WagonTransporter.put(WagonTransporter.java:410)
        at org.eclipse.aether.connector.basic.BasicRepositoryConnector$PutTaskRunner.runTask(BasicRepositoryConnector.java:510)
        at org.eclipse.aether.connector.basic.BasicRepositoryConnector$TaskRunner.run(BasicRepositoryConnector.java:350)
        ... 16 more
[INFO] Deployment failed after 3.5 sec
Build step 'Deploy artifacts to Maven repository' changed build result to FAILURE
Reply | Threaded
Open this post in threaded view
|

Jenkins build is unstable: xmlgraphics-fop #217

Apache Jenkins Server
Reply | Threaded
Open this post in threaded view
|

Build failed in Jenkins: xmlgraphics-fop #218

Apache Jenkins Server
See <https://builds.apache.org/job/xmlgraphics-fop/218/display/redirect?page=changes>

Changes:

[matthias] FOP-2818: fix failing test

------------------------------------------
[...truncated 112.41 KB...]
Downloading: https://repository.apache.org/content/repositories/snapshots/org/apache/xmlgraphics/batik-ttf2svg/1.11.0-SNAPSHOT/maven-metadata.xml
Downloading: https://repository.jboss.org/nexus/content/repositories/thirdparty-releases/org/apache/xmlgraphics/batik-ttf2svg/1.11.0-SNAPSHOT/maven-metadata.xml
[WARNING] Could not transfer metadata org.apache.xmlgraphics:batik-ttf2svg:1.11.0-SNAPSHOT/maven-metadata.xml from/to apache.snapshots.https (https://repository.apache.org/content/repositories/snapshots): Not authorized, ReasonPhrase:Unauthorized.
[INFO]
[INFO] --- maven-clean-plugin:2.4.1:clean (default-clean) @ fop-servlet ---
[INFO] Deleting <https://builds.apache.org/job/xmlgraphics-fop/ws/fop-servlet/target>
[INFO]
[INFO] --- maven-resources-plugin:2.5:resources (default-resources) @ fop-servlet ---
[debug] execute contextualize
[INFO] Using 'UTF-8' encoding to copy filtered resources.
[INFO] skip non existing resourceDirectory <https://builds.apache.org/job/xmlgraphics-fop/ws/fop-servlet/src/main/resources>
[INFO]
[INFO] --- maven-compiler-plugin:3.1:compile (default-compile) @ fop-servlet ---
[INFO] No sources to compile
[INFO]
[INFO] --- maven-resources-plugin:2.5:testResources (default-testResources) @ fop-servlet ---
[debug] execute contextualize
[INFO] Using 'UTF-8' encoding to copy filtered resources.
[INFO] skip non existing resourceDirectory <https://builds.apache.org/job/xmlgraphics-fop/ws/fop-servlet/src/test/resources>
[INFO]
[INFO] --- maven-compiler-plugin:3.1:testCompile (default-testCompile) @ fop-servlet ---
[INFO] No sources to compile
[INFO]
[INFO] --- maven-surefire-plugin:2.18.1:test (default-test) @ fop-servlet ---
[INFO] No tests to run.
[JENKINS] Recording test results
[INFO]
[INFO] --- maven-war-plugin:2.2:war (default-war) @ fop-servlet ---
[INFO] Packaging webapp
[INFO] Assembling webapp [fop-servlet] in [<https://builds.apache.org/job/xmlgraphics-fop/ws/fop-servlet/target/fop-servlet-2.4.0-SNAPSHOT]>
[INFO] Processing war project
[INFO] Copying webapp resources [<https://builds.apache.org/job/xmlgraphics-fop/ws/fop-servlet/src/main/webapp]>
[INFO] Webapp assembled in [97 msecs]
[INFO] Building war: <https://builds.apache.org/job/xmlgraphics-fop/ws/fop-servlet/target/fop-servlet-2.4.0-SNAPSHOT.war>
[INFO]
[INFO] --- maven-install-plugin:2.3.1:install (default-install) @ fop-servlet ---
[INFO] Installing <https://builds.apache.org/job/xmlgraphics-fop/ws/fop-servlet/target/fop-servlet-2.4.0-SNAPSHOT.war> to /home/jenkins/jenkins-slave/maven-repositories/0/org/apache/xmlgraphics/fop-servlet/2.4.0-SNAPSHOT/fop-servlet-2.4.0-SNAPSHOT.war
[INFO] Installing <https://builds.apache.org/job/xmlgraphics-fop/ws/fop-servlet/pom.xml> to /home/jenkins/jenkins-slave/maven-repositories/0/org/apache/xmlgraphics/fop-servlet/2.4.0-SNAPSHOT/fop-servlet-2.4.0-SNAPSHOT.pom
[INFO]
[INFO] --- maven-checkstyle-plugin:2.14:checkstyle (default-cli) @ fop-servlet ---
[CHECKSTYLE] No report found for mojo checkstyle[INFO]

[INFO] --- findbugs-maven-plugin:3.0.5:findbugs (default-cli) @ fop-servlet ---
[FINDBUGS] No report found for mojo findbugs
[INFO]                                                                        
[INFO] ------------------------------------------------------------------------
[INFO] Building Apache FOP Transcoder 2.4.0-SNAPSHOT
[INFO] ------------------------------------------------------------------------
[INFO]
[INFO] --- maven-clean-plugin:2.4.1:clean (default-clean) @ fop-transcoder ---
[INFO] Deleting <https://builds.apache.org/job/xmlgraphics-fop/ws/fop-transcoder/target>
[INFO]
[INFO] --- maven-resources-plugin:2.5:resources (default-resources) @ fop-transcoder ---
[debug] execute contextualize
[INFO] Using 'UTF-8' encoding to copy filtered resources.
[INFO] skip non existing resourceDirectory <https://builds.apache.org/job/xmlgraphics-fop/ws/fop-transcoder/src/main/resources>
[INFO]
[INFO] --- maven-compiler-plugin:3.1:compile (default-compile) @ fop-transcoder ---
[INFO] No sources to compile
[INFO]
[INFO] --- maven-resources-plugin:2.5:testResources (default-testResources) @ fop-transcoder ---
[debug] execute contextualize
[INFO] Using 'UTF-8' encoding to copy filtered resources.
[INFO] skip non existing resourceDirectory <https://builds.apache.org/job/xmlgraphics-fop/ws/fop-transcoder/src/test/resources>
[INFO]
[INFO] --- maven-compiler-plugin:3.1:testCompile (default-testCompile) @ fop-transcoder ---
[INFO] No sources to compile
[INFO]
[INFO] --- maven-surefire-plugin:2.18.1:test (default-test) @ fop-transcoder ---
[INFO] No tests to run.
[JENKINS] Recording test results
[INFO]
[INFO] --- maven-jar-plugin:2.6:jar (default-jar) @ fop-transcoder ---
[WARNING] JAR will be empty - no content was marked for inclusion!
[INFO] Building jar: <https://builds.apache.org/job/xmlgraphics-fop/ws/fop-transcoder/target/fop-transcoder-2.4.0-SNAPSHOT.jar>
[INFO]
[INFO] --- maven-assembly-plugin:2.2-beta-5:single (package-all) @ fop-transcoder ---
[INFO] Reading assembly descriptor: src/tools/resources/assembly/assembly.xml
[WARNING] Artifact: org.apache.xmlgraphics:fop-transcoder:jar:2.4.0-SNAPSHOT references the same file as the assembly destination file. Moving it to a temporary location for inclusion.
[INFO] Building jar: <https://builds.apache.org/job/xmlgraphics-fop/ws/fop-transcoder/target/fop-transcoder-2.4.0-SNAPSHOT.jar>
[WARNING] Configuration options: 'appendAssemblyId' is set to false, and 'classifier' is missing.
Instead of attaching the assembly file: <https://builds.apache.org/job/xmlgraphics-fop/ws/fop-transcoder/target/fop-transcoder-2.4.0-SNAPSHOT.jar,> it will become the file for main project artifact.
NOTE: If multiple descriptors or descriptor-formats are provided for this project, the value of this file will be non-deterministic!
[WARNING] Replacing pre-existing project main-artifact file: <https://builds.apache.org/job/xmlgraphics-fop/ws/fop-transcoder/target/archive-tmp/fop-transcoder-2.4.0-SNAPSHOT.jar>
with assembly file: <https://builds.apache.org/job/xmlgraphics-fop/ws/fop-transcoder/target/fop-transcoder-2.4.0-SNAPSHOT.jar>
[INFO]
[INFO] --- maven-install-plugin:2.3.1:install (default-install) @ fop-transcoder ---
[INFO] Installing <https://builds.apache.org/job/xmlgraphics-fop/ws/fop-transcoder/target/fop-transcoder-2.4.0-SNAPSHOT.jar> to /home/jenkins/jenkins-slave/maven-repositories/0/org/apache/xmlgraphics/fop-transcoder/2.4.0-SNAPSHOT/fop-transcoder-2.4.0-SNAPSHOT.jar
[INFO] Installing <https://builds.apache.org/job/xmlgraphics-fop/ws/fop-transcoder/pom.xml> to /home/jenkins/jenkins-slave/maven-repositories/0/org/apache/xmlgraphics/fop-transcoder/2.4.0-SNAPSHOT/fop-transcoder-2.4.0-SNAPSHOT.pom
[INFO]
[INFO] --- maven-checkstyle-plugin:2.14:checkstyle (default-cli) @ fop-transcoder ---
[CHECKSTYLE] No report found for mojo checkstyle
[INFO]
[INFO] --- findbugs-maven-plugin:3.0.5:findbugs (default-cli) @ fop-transcoder ---
[FINDBUGS] No report found for mojo findbugs
[INFO]                                                                        
[INFO] ------------------------------------------------------------------------
[INFO] Building Apache FOP Transcoder All-In-One 2.4.0-SNAPSHOT
[INFO] ------------------------------------------------------------------------
[INFO]
[INFO] --- maven-clean-plugin:2.4.1:clean (default-clean) @ fop-transcoder-allinone ---
[INFO] Deleting <https://builds.apache.org/job/xmlgraphics-fop/ws/fop-transcoder-allinone/target>
[INFO]
[INFO] --- maven-resources-plugin:2.5:resources (default-resources) @ fop-transcoder-allinone ---
[debug] execute contextualize
[INFO] Using 'UTF-8' encoding to copy filtered resources.
[INFO] skip non existing resourceDirectory <https://builds.apache.org/job/xmlgraphics-fop/ws/fop-transcoder-allinone/src/main/resources>
[INFO]
[INFO] --- maven-compiler-plugin:3.1:compile (default-compile) @ fop-transcoder-allinone ---
[INFO] No sources to compile
[INFO]
[INFO] --- maven-resources-plugin:2.5:testResources (default-testResources) @ fop-transcoder-allinone ---
[debug] execute contextualize
[INFO] Using 'UTF-8' encoding to copy filtered resources.
[INFO] skip non existing resourceDirectory <https://builds.apache.org/job/xmlgraphics-fop/ws/fop-transcoder-allinone/src/test/resources>
[INFO]
[INFO] --- maven-compiler-plugin:3.1:testCompile (default-testCompile) @ fop-transcoder-allinone ---
[INFO] No sources to compile
[INFO]
[INFO] --- maven-surefire-plugin:2.18.1:test (default-test) @ fop-transcoder-allinone ---
[INFO] No tests to run.
[JENKINS] Recording test results
[INFO]
[INFO] --- maven-jar-plugin:2.6:jar (default-jar) @ fop-transcoder-allinone ---
[WARNING] JAR will be empty - no content was marked for inclusion!
[INFO] Building jar: <https://builds.apache.org/job/xmlgraphics-fop/ws/fop-transcoder-allinone/target/fop-transcoder-allinone-2.4.0-SNAPSHOT.jar>
[INFO]
[INFO] --- maven-assembly-plugin:2.2-beta-5:single (package-all) @ fop-transcoder-allinone ---
[INFO] Reading assembly descriptor: src/tools/resources/assembly/assembly.xml
[WARNING] Artifact: org.apache.xmlgraphics:fop-transcoder-allinone:jar:2.4.0-SNAPSHOT references the same file as the assembly destination file. Moving it to a temporary location for inclusion.
[INFO] org/apache/avalon/framework/component/ already added, skipping
[INFO] org/apache/avalon/framework/configuration/ already added, skipping
[INFO] org/apache/avalon/framework/context/ already added, skipping
[INFO] org/apache/avalon/framework/logger/ already added, skipping
[INFO] org/apache/avalon/framework/service/ already added, skipping
[INFO] Building jar: <https://builds.apache.org/job/xmlgraphics-fop/ws/fop-transcoder-allinone/target/fop-transcoder-allinone-2.4.0-SNAPSHOT.jar>
[INFO] org/apache/avalon/framework/component/ already added, skipping
[INFO] org/apache/avalon/framework/configuration/ already added, skipping
[INFO] org/apache/avalon/framework/context/ already added, skipping
[INFO] org/apache/avalon/framework/logger/ already added, skipping
[INFO] org/apache/avalon/framework/service/ already added, skipping
[WARNING] Configuration options: 'appendAssemblyId' is set to false, and 'classifier' is missing.
Instead of attaching the assembly file: <https://builds.apache.org/job/xmlgraphics-fop/ws/fop-transcoder-allinone/target/fop-transcoder-allinone-2.4.0-SNAPSHOT.jar,> it will become the file for main project artifact.
NOTE: If multiple descriptors or descriptor-formats are provided for this project, the value of this file will be non-deterministic!
[WARNING] Replacing pre-existing project main-artifact file: <https://builds.apache.org/job/xmlgraphics-fop/ws/fop-transcoder-allinone/target/archive-tmp/fop-transcoder-allinone-2.4.0-SNAPSHOT.jar>
with assembly file: <https://builds.apache.org/job/xmlgraphics-fop/ws/fop-transcoder-allinone/target/fop-transcoder-allinone-2.4.0-SNAPSHOT.jar>
[INFO]
[INFO] --- maven-install-plugin:2.3.1:install (default-install) @ fop-transcoder-allinone ---
[INFO] Installing <https://builds.apache.org/job/xmlgraphics-fop/ws/fop-transcoder-allinone/target/fop-transcoder-allinone-2.4.0-SNAPSHOT.jar> to /home/jenkins/jenkins-slave/maven-repositories/0/org/apache/xmlgraphics/fop-transcoder-allinone/2.4.0-SNAPSHOT/fop-transcoder-allinone-2.4.0-SNAPSHOT.jar
[INFO] Installing <https://builds.apache.org/job/xmlgraphics-fop/ws/fop-transcoder-allinone/pom.xml> to /home/jenkins/jenkins-slave/maven-repositories/0/org/apache/xmlgraphics/fop-transcoder-allinone/2.4.0-SNAPSHOT/fop-transcoder-allinone-2.4.0-SNAPSHOT.pom
[INFO]
[INFO] --- maven-checkstyle-plugin:2.14:checkstyle (default-cli) @ fop-transcoder-allinone ---
[CHECKSTYLE] No report found for mojo checkstyle[INFO]

[INFO] --- findbugs-maven-plugin:3.0.5:findbugs (default-cli) @ fop-transcoder-allinone ---
[FINDBUGS] No report found for mojo findbugs
[INFO] ------------------------------------------------------------------------
[INFO] Reactor Summary:
[INFO]
[INFO] Apache FOP Parent ................................. SUCCESS [17.565s]
[INFO] Apache FOP Utilities .............................. SUCCESS [2:15.040s]
[INFO] Apache FOP Events ................................. SUCCESS [20.467s]
[INFO] Apache FOP Core ................................... SUCCESS [4:13.689s]
[INFO] Apache FOP All-In-One ............................. SUCCESS [6.379s]
[INFO] Apache FOP Sandbox ................................ SUCCESS [13.631s]
[INFO] Apache FOP Servlet ................................ SUCCESS [15.966s]
[INFO] Apache FOP Transcoder ............................. SUCCESS [4.400s]
[INFO] Apache FOP Transcoder All-In-One .................. SUCCESS [4.500s]
[INFO] ------------------------------------------------------------------------
[INFO] BUILD SUCCESS
[INFO] ------------------------------------------------------------------------
[INFO] Total time: 8:26.395s
[INFO] Finished at: Wed Oct 10 20:43:01 UTC 2018
[INFO] Final Memory: 83M/4051M
[INFO] ------------------------------------------------------------------------
Waiting for Jenkins to finish collecting data
[JENKINS] Archiving <https://builds.apache.org/job/xmlgraphics-fop/ws/fop-sandbox/pom.xml> to org.apache.xmlgraphics/fop-sandbox/2.4.0-SNAPSHOT/fop-sandbox-2.4.0-SNAPSHOT.pom
[JENKINS] Archiving <https://builds.apache.org/job/xmlgraphics-fop/ws/fop-sandbox/target/fop-sandbox-2.4.0-SNAPSHOT.jar> to org.apache.xmlgraphics/fop-sandbox/2.4.0-SNAPSHOT/fop-sandbox-2.4.0-SNAPSHOT.jar
[JENKINS] Archiving <https://builds.apache.org/job/xmlgraphics-fop/ws/pom.xml> to org.apache.xmlgraphics/fop-parent/2.4.0-SNAPSHOT/fop-parent-2.4.0-SNAPSHOT.pom
[JENKINS] Archiving <https://builds.apache.org/job/xmlgraphics-fop/ws/fop-core/pom.xml> to org.apache.xmlgraphics/fop-core/2.4.0-SNAPSHOT/fop-core-2.4.0-SNAPSHOT.pom
[JENKINS] Archiving <https://builds.apache.org/job/xmlgraphics-fop/ws/fop-core/target/fop-core-2.4.0-SNAPSHOT.jar> to org.apache.xmlgraphics/fop-core/2.4.0-SNAPSHOT/fop-core-2.4.0-SNAPSHOT.jar
[JENKINS] Archiving <https://builds.apache.org/job/xmlgraphics-fop/ws/fop/pom.xml> to org.apache.xmlgraphics/fop/2.4.0-SNAPSHOT/fop-2.4.0-SNAPSHOT.pom
[JENKINS] Archiving <https://builds.apache.org/job/xmlgraphics-fop/ws/fop/target/fop-2.4.0-SNAPSHOT.jar> to org.apache.xmlgraphics/fop/2.4.0-SNAPSHOT/fop-2.4.0-SNAPSHOT.jar
[JENKINS] Archiving <https://builds.apache.org/job/xmlgraphics-fop/ws/fop-servlet/pom.xml> to org.apache.xmlgraphics/fop-servlet/2.4.0-SNAPSHOT/fop-servlet-2.4.0-SNAPSHOT.pom
[JENKINS] Archiving <https://builds.apache.org/job/xmlgraphics-fop/ws/fop-servlet/target/fop-servlet-2.4.0-SNAPSHOT.war> to org.apache.xmlgraphics/fop-servlet/2.4.0-SNAPSHOT/fop-servlet-2.4.0-SNAPSHOT.war
[JENKINS] Archiving <https://builds.apache.org/job/xmlgraphics-fop/ws/fop-transcoder-allinone/pom.xml> to org.apache.xmlgraphics/fop-transcoder-allinone/2.4.0-SNAPSHOT/fop-transcoder-allinone-2.4.0-SNAPSHOT.pom
[JENKINS] Archiving <https://builds.apache.org/job/xmlgraphics-fop/ws/fop-transcoder-allinone/target/fop-transcoder-allinone-2.4.0-SNAPSHOT.jar> to org.apache.xmlgraphics/fop-transcoder-allinone/2.4.0-SNAPSHOT/fop-transcoder-allinone-2.4.0-SNAPSHOT.jar
[JENKINS] Archiving <https://builds.apache.org/job/xmlgraphics-fop/ws/fop-util/pom.xml> to org.apache.xmlgraphics/fop-util/2.4.0-SNAPSHOT/fop-util-2.4.0-SNAPSHOT.pom
[JENKINS] Archiving <https://builds.apache.org/job/xmlgraphics-fop/ws/fop-util/target/fop-util-2.4.0-SNAPSHOT.jar> to org.apache.xmlgraphics/fop-util/2.4.0-SNAPSHOT/fop-util-2.4.0-SNAPSHOT.jar
[JENKINS] Archiving <https://builds.apache.org/job/xmlgraphics-fop/ws/fop-events/pom.xml> to org.apache.xmlgraphics/fop-events/2.4.0-SNAPSHOT/fop-events-2.4.0-SNAPSHOT.pom
[JENKINS] Archiving <https://builds.apache.org/job/xmlgraphics-fop/ws/fop-events/target/fop-events-2.4.0-SNAPSHOT.jar> to org.apache.xmlgraphics/fop-events/2.4.0-SNAPSHOT/fop-events-2.4.0-SNAPSHOT.jar
[JENKINS] Archiving <https://builds.apache.org/job/xmlgraphics-fop/ws/fop-transcoder/pom.xml> to org.apache.xmlgraphics/fop-transcoder/2.4.0-SNAPSHOT/fop-transcoder-2.4.0-SNAPSHOT.pom
[JENKINS] Archiving <https://builds.apache.org/job/xmlgraphics-fop/ws/fop-transcoder/target/fop-transcoder-2.4.0-SNAPSHOT.jar> to org.apache.xmlgraphics/fop-transcoder/2.4.0-SNAPSHOT/fop-transcoder-2.4.0-SNAPSHOT.jar
[CHECKSTYLE] Plug-in Result: Success - no threshold has been exceeded
[CHECKSTYLE] Plug-in Result: Success - no threshold has been exceeded
[CHECKSTYLE] Plug-in Result: Success - no threshold has been exceeded
[CHECKSTYLE] Plug-in Result: Success - no threshold has been exceeded
[FINDBUGS] Plug-in Result: Success - no threshold has been exceeded
[FINDBUGS] Plug-in Result: Success - no threshold has been exceeded
[FINDBUGS] Plug-in Result: Success - no threshold has been exceeded
[FINDBUGS] Plug-in Result: Success - no threshold has been exceeded
channel stopped
Maven RedeployPublisher use remote ubuntu-1 maven settings from : /home/jenkins/.m2/settings.xml
[INFO] Deployment in https://repository.apache.org/content/repositories/snapshots (id=apache.snapshots.https,uniqueVersion=true)
Deploying the main artifact fop-2.4.0-SNAPSHOT.jar
Downloading: https://repository.apache.org/content/repositories/snapshots/org/apache/xmlgraphics/fop/2.4.0-SNAPSHOT/maven-metadata.xml
Downloaded: https://repository.apache.org/content/repositories/snapshots/org/apache/xmlgraphics/fop/2.4.0-SNAPSHOT/maven-metadata.xml (778 B at 0.9 KB/sec)
Uploading: https://repository.apache.org/content/repositories/snapshots/org/apache/xmlgraphics/fop/2.4.0-SNAPSHOT/fop-2.4.0-20181010.204324-12.jar
Uploading: https://repository.apache.org/content/repositories/snapshots/org/apache/xmlgraphics/fop/2.4.0-SNAPSHOT/fop-2.4.0-20181010.204324-12.pom
ERROR: Failed to deploy artifacts: Could not transfer artifact org.apache.xmlgraphics:fop:jar:2.4.0-20181010.204324-12 from/to apache.snapshots.https (https://repository.apache.org/content/repositories/snapshots): Failed to transfer file: https://repository.apache.org/content/repositories/snapshots/org/apache/xmlgraphics/fop/2.4.0-SNAPSHOT/fop-2.4.0-20181010.204324-12.jar. Return code is: 401, ReasonPhrase: Unauthorized.
org.apache.maven.artifact.deployer.ArtifactDeploymentException: Failed to deploy artifacts: Could not transfer artifact org.apache.xmlgraphics:fop:jar:2.4.0-20181010.204324-12 from/to apache.snapshots.https (https://repository.apache.org/content/repositories/snapshots): Failed to transfer file: https://repository.apache.org/content/repositories/snapshots/org/apache/xmlgraphics/fop/2.4.0-SNAPSHOT/fop-2.4.0-20181010.204324-12.jar. Return code is: 401, ReasonPhrase: Unauthorized.
        at org.apache.maven.artifact.deployer.DefaultArtifactDeployer.deploy(DefaultArtifactDeployer.java:143)
        at hudson.maven.reporters.MavenArtifactRecord.deploy(MavenArtifactRecord.java:193)
        at hudson.maven.RedeployPublisher.perform(RedeployPublisher.java:176)
        at hudson.tasks.BuildStepMonitor$1.perform(BuildStepMonitor.java:20)
        at hudson.model.AbstractBuild$AbstractBuildExecution.perform(AbstractBuild.java:744)
        at hudson.model.AbstractBuild$AbstractBuildExecution.performAllBuildSteps(AbstractBuild.java:690)
        at hudson.maven.MavenModuleSetBuild$MavenModuleSetBuildExecution.post2(MavenModuleSetBuild.java:1073)
        at hudson.model.AbstractBuild$AbstractBuildExecution.post(AbstractBuild.java:635)
        at hudson.model.Run.execute(Run.java:1819)
        at hudson.maven.MavenModuleSetBuild.run(MavenModuleSetBuild.java:543)
        at hudson.model.ResourceController.execute(ResourceController.java:97)
        at hudson.model.Executor.run(Executor.java:429)
Caused by: org.eclipse.aether.deployment.DeploymentException: Failed to deploy artifacts: Could not transfer artifact org.apache.xmlgraphics:fop:jar:2.4.0-20181010.204324-12 from/to apache.snapshots.https (https://repository.apache.org/content/repositories/snapshots): Failed to transfer file: https://repository.apache.org/content/repositories/snapshots/org/apache/xmlgraphics/fop/2.4.0-SNAPSHOT/fop-2.4.0-20181010.204324-12.jar. Return code is: 401, ReasonPhrase: Unauthorized.
        at org.eclipse.aether.internal.impl.DefaultDeployer.deploy(DefaultDeployer.java:317)
        at org.eclipse.aether.internal.impl.DefaultDeployer.deploy(DefaultDeployer.java:245)
        at org.eclipse.aether.internal.impl.DefaultRepositorySystem.deploy(DefaultRepositorySystem.java:420)
        at org.apache.maven.artifact.deployer.DefaultArtifactDeployer.deploy(DefaultArtifactDeployer.java:139)
        ... 11 more
Caused by: org.eclipse.aether.transfer.ArtifactTransferException: Could not transfer artifact org.apache.xmlgraphics:fop:jar:2.4.0-20181010.204324-12 from/to apache.snapshots.https (https://repository.apache.org/content/repositories/snapshots): Failed to transfer file: https://repository.apache.org/content/repositories/snapshots/org/apache/xmlgraphics/fop/2.4.0-SNAPSHOT/fop-2.4.0-20181010.204324-12.jar. Return code is: 401, ReasonPhrase: Unauthorized.
        at org.eclipse.aether.connector.basic.ArtifactTransportListener.transferFailed(ArtifactTransportListener.java:43)
        at org.eclipse.aether.connector.basic.BasicRepositoryConnector$TaskRunner.run(BasicRepositoryConnector.java:355)
        at org.eclipse.aether.connector.basic.BasicRepositoryConnector.put(BasicRepositoryConnector.java:274)
        at org.eclipse.aether.internal.impl.DefaultDeployer.deploy(DefaultDeployer.java:311)
        ... 14 more
Caused by: org.apache.maven.wagon.TransferFailedException: Failed to transfer file: https://repository.apache.org/content/repositories/snapshots/org/apache/xmlgraphics/fop/2.4.0-SNAPSHOT/fop-2.4.0-20181010.204324-12.jar. Return code is: 401, ReasonPhrase: Unauthorized.
        at org.apache.maven.wagon.shared.http.AbstractHttpClientWagon.put(AbstractHttpClientWagon.java:635)
        at org.apache.maven.wagon.shared.http.AbstractHttpClientWagon.put(AbstractHttpClientWagon.java:557)
        at org.apache.maven.wagon.shared.http.AbstractHttpClientWagon.put(AbstractHttpClientWagon.java:539)
        at org.apache.maven.wagon.shared.http.AbstractHttpClientWagon.put(AbstractHttpClientWagon.java:533)
        at org.apache.maven.wagon.shared.http.AbstractHttpClientWagon.put(AbstractHttpClientWagon.java:513)
        at org.eclipse.aether.transport.wagon.WagonTransporter$PutTaskRunner.run(WagonTransporter.java:644)
        at org.eclipse.aether.transport.wagon.WagonTransporter.execute(WagonTransporter.java:427)
        at org.eclipse.aether.transport.wagon.WagonTransporter.put(WagonTransporter.java:410)
        at org.eclipse.aether.connector.basic.BasicRepositoryConnector$PutTaskRunner.runTask(BasicRepositoryConnector.java:510)
        at org.eclipse.aether.connector.basic.BasicRepositoryConnector$TaskRunner.run(BasicRepositoryConnector.java:350)
        ... 16 more
[INFO] Deployment failed after 3.9 sec
Build step 'Deploy artifacts to Maven repository' changed build result to FAILURE
Reply | Threaded
Open this post in threaded view
|

Re: Build failed in Jenkins: xmlgraphics-fop #218

Matthias Reischenbacher
Hi team,

is the "Return code is: 401, ReasonPhrase: Unauthorized." error related
to the fact, that I'm committing and missing some access rights? Or is
this just a temporary repository server issue?

Best regards,

Matthias


On 10.10.2018 17:43, Apache Jenkins Server wrote:

> See <https://builds.apache.org/job/xmlgraphics-fop/218/display/redirect?page=changes>
>
> Changes:
>
> [matthias] FOP-2818: fix failing test
>
> ------------------------------------------
> [...truncated 112.41 KB...]
> Downloading: https://repository.apache.org/content/repositories/snapshots/org/apache/xmlgraphics/batik-ttf2svg/1.11.0-SNAPSHOT/maven-metadata.xml
> Downloading: https://repository.jboss.org/nexus/content/repositories/thirdparty-releases/org/apache/xmlgraphics/batik-ttf2svg/1.11.0-SNAPSHOT/maven-metadata.xml
> [WARNING] Could not transfer metadata org.apache.xmlgraphics:batik-ttf2svg:1.11.0-SNAPSHOT/maven-metadata.xml from/to apache.snapshots.https (https://repository.apache.org/content/repositories/snapshots): Not authorized, ReasonPhrase:Unauthorized.
> [INFO]
> [INFO] --- maven-clean-plugin:2.4.1:clean (default-clean) @ fop-servlet ---
> [INFO] Deleting <https://builds.apache.org/job/xmlgraphics-fop/ws/fop-servlet/target>
> [INFO]
> [INFO] --- maven-resources-plugin:2.5:resources (default-resources) @ fop-servlet ---
> [debug] execute contextualize
> [INFO] Using 'UTF-8' encoding to copy filtered resources.
> [INFO] skip non existing resourceDirectory <https://builds.apache.org/job/xmlgraphics-fop/ws/fop-servlet/src/main/resources>
> [INFO]
> [INFO] --- maven-compiler-plugin:3.1:compile (default-compile) @ fop-servlet ---
> [INFO] No sources to compile
> [INFO]
> [INFO] --- maven-resources-plugin:2.5:testResources (default-testResources) @ fop-servlet ---
> [debug] execute contextualize
> [INFO] Using 'UTF-8' encoding to copy filtered resources.
> [INFO] skip non existing resourceDirectory <https://builds.apache.org/job/xmlgraphics-fop/ws/fop-servlet/src/test/resources>
> [INFO]
> [INFO] --- maven-compiler-plugin:3.1:testCompile (default-testCompile) @ fop-servlet ---
> [INFO] No sources to compile
> [INFO]
> [INFO] --- maven-surefire-plugin:2.18.1:test (default-test) @ fop-servlet ---
> [INFO] No tests to run.
> [JENKINS] Recording test results
> [INFO]
> [INFO] --- maven-war-plugin:2.2:war (default-war) @ fop-servlet ---
> [INFO] Packaging webapp
> [INFO] Assembling webapp [fop-servlet] in [<https://builds.apache.org/job/xmlgraphics-fop/ws/fop-servlet/target/fop-servlet-2.4.0-SNAPSHOT]>
> [INFO] Processing war project
> [INFO] Copying webapp resources [<https://builds.apache.org/job/xmlgraphics-fop/ws/fop-servlet/src/main/webapp]>
> [INFO] Webapp assembled in [97 msecs]
> [INFO] Building war: <https://builds.apache.org/job/xmlgraphics-fop/ws/fop-servlet/target/fop-servlet-2.4.0-SNAPSHOT.war>
> [INFO]
> [INFO] --- maven-install-plugin:2.3.1:install (default-install) @ fop-servlet ---
> [INFO] Installing <https://builds.apache.org/job/xmlgraphics-fop/ws/fop-servlet/target/fop-servlet-2.4.0-SNAPSHOT.war> to /home/jenkins/jenkins-slave/maven-repositories/0/org/apache/xmlgraphics/fop-servlet/2.4.0-SNAPSHOT/fop-servlet-2.4.0-SNAPSHOT.war
> [INFO] Installing <https://builds.apache.org/job/xmlgraphics-fop/ws/fop-servlet/pom.xml> to /home/jenkins/jenkins-slave/maven-repositories/0/org/apache/xmlgraphics/fop-servlet/2.4.0-SNAPSHOT/fop-servlet-2.4.0-SNAPSHOT.pom
> [INFO]
> [INFO] --- maven-checkstyle-plugin:2.14:checkstyle (default-cli) @ fop-servlet ---
> [CHECKSTYLE] No report found for mojo checkstyle[INFO]
>
> [INFO] --- findbugs-maven-plugin:3.0.5:findbugs (default-cli) @ fop-servlet ---
> [FINDBUGS] No report found for mojo findbugs
> [INFO]                                                                        
> [INFO] ------------------------------------------------------------------------
> [INFO] Building Apache FOP Transcoder 2.4.0-SNAPSHOT
> [INFO] ------------------------------------------------------------------------
> [INFO]
> [INFO] --- maven-clean-plugin:2.4.1:clean (default-clean) @ fop-transcoder ---
> [INFO] Deleting <https://builds.apache.org/job/xmlgraphics-fop/ws/fop-transcoder/target>
> [INFO]
> [INFO] --- maven-resources-plugin:2.5:resources (default-resources) @ fop-transcoder ---
> [debug] execute contextualize
> [INFO] Using 'UTF-8' encoding to copy filtered resources.
> [INFO] skip non existing resourceDirectory <https://builds.apache.org/job/xmlgraphics-fop/ws/fop-transcoder/src/main/resources>
> [INFO]
> [INFO] --- maven-compiler-plugin:3.1:compile (default-compile) @ fop-transcoder ---
> [INFO] No sources to compile
> [INFO]
> [INFO] --- maven-resources-plugin:2.5:testResources (default-testResources) @ fop-transcoder ---
> [debug] execute contextualize
> [INFO] Using 'UTF-8' encoding to copy filtered resources.
> [INFO] skip non existing resourceDirectory <https://builds.apache.org/job/xmlgraphics-fop/ws/fop-transcoder/src/test/resources>
> [INFO]
> [INFO] --- maven-compiler-plugin:3.1:testCompile (default-testCompile) @ fop-transcoder ---
> [INFO] No sources to compile
> [INFO]
> [INFO] --- maven-surefire-plugin:2.18.1:test (default-test) @ fop-transcoder ---
> [INFO] No tests to run.
> [JENKINS] Recording test results
> [INFO]
> [INFO] --- maven-jar-plugin:2.6:jar (default-jar) @ fop-transcoder ---
> [WARNING] JAR will be empty - no content was marked for inclusion!
> [INFO] Building jar: <https://builds.apache.org/job/xmlgraphics-fop/ws/fop-transcoder/target/fop-transcoder-2.4.0-SNAPSHOT.jar>
> [INFO]
> [INFO] --- maven-assembly-plugin:2.2-beta-5:single (package-all) @ fop-transcoder ---
> [INFO] Reading assembly descriptor: src/tools/resources/assembly/assembly.xml
> [WARNING] Artifact: org.apache.xmlgraphics:fop-transcoder:jar:2.4.0-SNAPSHOT references the same file as the assembly destination file. Moving it to a temporary location for inclusion.
> [INFO] Building jar: <https://builds.apache.org/job/xmlgraphics-fop/ws/fop-transcoder/target/fop-transcoder-2.4.0-SNAPSHOT.jar>
> [WARNING] Configuration options: 'appendAssemblyId' is set to false, and 'classifier' is missing.
> Instead of attaching the assembly file: <https://builds.apache.org/job/xmlgraphics-fop/ws/fop-transcoder/target/fop-transcoder-2.4.0-SNAPSHOT.jar,> it will become the file for main project artifact.
> NOTE: If multiple descriptors or descriptor-formats are provided for this project, the value of this file will be non-deterministic!
> [WARNING] Replacing pre-existing project main-artifact file: <https://builds.apache.org/job/xmlgraphics-fop/ws/fop-transcoder/target/archive-tmp/fop-transcoder-2.4.0-SNAPSHOT.jar>
> with assembly file: <https://builds.apache.org/job/xmlgraphics-fop/ws/fop-transcoder/target/fop-transcoder-2.4.0-SNAPSHOT.jar>
> [INFO]
> [INFO] --- maven-install-plugin:2.3.1:install (default-install) @ fop-transcoder ---
> [INFO] Installing <https://builds.apache.org/job/xmlgraphics-fop/ws/fop-transcoder/target/fop-transcoder-2.4.0-SNAPSHOT.jar> to /home/jenkins/jenkins-slave/maven-repositories/0/org/apache/xmlgraphics/fop-transcoder/2.4.0-SNAPSHOT/fop-transcoder-2.4.0-SNAPSHOT.jar
> [INFO] Installing <https://builds.apache.org/job/xmlgraphics-fop/ws/fop-transcoder/pom.xml> to /home/jenkins/jenkins-slave/maven-repositories/0/org/apache/xmlgraphics/fop-transcoder/2.4.0-SNAPSHOT/fop-transcoder-2.4.0-SNAPSHOT.pom
> [INFO]
> [INFO] --- maven-checkstyle-plugin:2.14:checkstyle (default-cli) @ fop-transcoder ---
> [CHECKSTYLE] No report found for mojo checkstyle
> [INFO]
> [INFO] --- findbugs-maven-plugin:3.0.5:findbugs (default-cli) @ fop-transcoder ---
> [FINDBUGS] No report found for mojo findbugs
> [INFO]                                                                        
> [INFO] ------------------------------------------------------------------------
> [INFO] Building Apache FOP Transcoder All-In-One 2.4.0-SNAPSHOT
> [INFO] ------------------------------------------------------------------------
> [INFO]
> [INFO] --- maven-clean-plugin:2.4.1:clean (default-clean) @ fop-transcoder-allinone ---
> [INFO] Deleting <https://builds.apache.org/job/xmlgraphics-fop/ws/fop-transcoder-allinone/target>
> [INFO]
> [INFO] --- maven-resources-plugin:2.5:resources (default-resources) @ fop-transcoder-allinone ---
> [debug] execute contextualize
> [INFO] Using 'UTF-8' encoding to copy filtered resources.
> [INFO] skip non existing resourceDirectory <https://builds.apache.org/job/xmlgraphics-fop/ws/fop-transcoder-allinone/src/main/resources>
> [INFO]
> [INFO] --- maven-compiler-plugin:3.1:compile (default-compile) @ fop-transcoder-allinone ---
> [INFO] No sources to compile
> [INFO]
> [INFO] --- maven-resources-plugin:2.5:testResources (default-testResources) @ fop-transcoder-allinone ---
> [debug] execute contextualize
> [INFO] Using 'UTF-8' encoding to copy filtered resources.
> [INFO] skip non existing resourceDirectory <https://builds.apache.org/job/xmlgraphics-fop/ws/fop-transcoder-allinone/src/test/resources>
> [INFO]
> [INFO] --- maven-compiler-plugin:3.1:testCompile (default-testCompile) @ fop-transcoder-allinone ---
> [INFO] No sources to compile
> [INFO]
> [INFO] --- maven-surefire-plugin:2.18.1:test (default-test) @ fop-transcoder-allinone ---
> [INFO] No tests to run.
> [JENKINS] Recording test results
> [INFO]
> [INFO] --- maven-jar-plugin:2.6:jar (default-jar) @ fop-transcoder-allinone ---
> [WARNING] JAR will be empty - no content was marked for inclusion!
> [INFO] Building jar: <https://builds.apache.org/job/xmlgraphics-fop/ws/fop-transcoder-allinone/target/fop-transcoder-allinone-2.4.0-SNAPSHOT.jar>
> [INFO]
> [INFO] --- maven-assembly-plugin:2.2-beta-5:single (package-all) @ fop-transcoder-allinone ---
> [INFO] Reading assembly descriptor: src/tools/resources/assembly/assembly.xml
> [WARNING] Artifact: org.apache.xmlgraphics:fop-transcoder-allinone:jar:2.4.0-SNAPSHOT references the same file as the assembly destination file. Moving it to a temporary location for inclusion.
> [INFO] org/apache/avalon/framework/component/ already added, skipping
> [INFO] org/apache/avalon/framework/configuration/ already added, skipping
> [INFO] org/apache/avalon/framework/context/ already added, skipping
> [INFO] org/apache/avalon/framework/logger/ already added, skipping
> [INFO] org/apache/avalon/framework/service/ already added, skipping
> [INFO] Building jar: <https://builds.apache.org/job/xmlgraphics-fop/ws/fop-transcoder-allinone/target/fop-transcoder-allinone-2.4.0-SNAPSHOT.jar>
> [INFO] org/apache/avalon/framework/component/ already added, skipping
> [INFO] org/apache/avalon/framework/configuration/ already added, skipping
> [INFO] org/apache/avalon/framework/context/ already added, skipping
> [INFO] org/apache/avalon/framework/logger/ already added, skipping
> [INFO] org/apache/avalon/framework/service/ already added, skipping
> [WARNING] Configuration options: 'appendAssemblyId' is set to false, and 'classifier' is missing.
> Instead of attaching the assembly file: <https://builds.apache.org/job/xmlgraphics-fop/ws/fop-transcoder-allinone/target/fop-transcoder-allinone-2.4.0-SNAPSHOT.jar,> it will become the file for main project artifact.
> NOTE: If multiple descriptors or descriptor-formats are provided for this project, the value of this file will be non-deterministic!
> [WARNING] Replacing pre-existing project main-artifact file: <https://builds.apache.org/job/xmlgraphics-fop/ws/fop-transcoder-allinone/target/archive-tmp/fop-transcoder-allinone-2.4.0-SNAPSHOT.jar>
> with assembly file: <https://builds.apache.org/job/xmlgraphics-fop/ws/fop-transcoder-allinone/target/fop-transcoder-allinone-2.4.0-SNAPSHOT.jar>
> [INFO]
> [INFO] --- maven-install-plugin:2.3.1:install (default-install) @ fop-transcoder-allinone ---
> [INFO] Installing <https://builds.apache.org/job/xmlgraphics-fop/ws/fop-transcoder-allinone/target/fop-transcoder-allinone-2.4.0-SNAPSHOT.jar> to /home/jenkins/jenkins-slave/maven-repositories/0/org/apache/xmlgraphics/fop-transcoder-allinone/2.4.0-SNAPSHOT/fop-transcoder-allinone-2.4.0-SNAPSHOT.jar
> [INFO] Installing <https://builds.apache.org/job/xmlgraphics-fop/ws/fop-transcoder-allinone/pom.xml> to /home/jenkins/jenkins-slave/maven-repositories/0/org/apache/xmlgraphics/fop-transcoder-allinone/2.4.0-SNAPSHOT/fop-transcoder-allinone-2.4.0-SNAPSHOT.pom
> [INFO]
> [INFO] --- maven-checkstyle-plugin:2.14:checkstyle (default-cli) @ fop-transcoder-allinone ---
> [CHECKSTYLE] No report found for mojo checkstyle[INFO]
>
> [INFO] --- findbugs-maven-plugin:3.0.5:findbugs (default-cli) @ fop-transcoder-allinone ---
> [FINDBUGS] No report found for mojo findbugs
> [INFO] ------------------------------------------------------------------------
> [INFO] Reactor Summary:
> [INFO]
> [INFO] Apache FOP Parent ................................. SUCCESS [17.565s]
> [INFO] Apache FOP Utilities .............................. SUCCESS [2:15.040s]
> [INFO] Apache FOP Events ................................. SUCCESS [20.467s]
> [INFO] Apache FOP Core ................................... SUCCESS [4:13.689s]
> [INFO] Apache FOP All-In-One ............................. SUCCESS [6.379s]
> [INFO] Apache FOP Sandbox ................................ SUCCESS [13.631s]
> [INFO] Apache FOP Servlet ................................ SUCCESS [15.966s]
> [INFO] Apache FOP Transcoder ............................. SUCCESS [4.400s]
> [INFO] Apache FOP Transcoder All-In-One .................. SUCCESS [4.500s]
> [INFO] ------------------------------------------------------------------------
> [INFO] BUILD SUCCESS
> [INFO] ------------------------------------------------------------------------
> [INFO] Total time: 8:26.395s
> [INFO] Finished at: Wed Oct 10 20:43:01 UTC 2018
> [INFO] Final Memory: 83M/4051M
> [INFO] ------------------------------------------------------------------------
> Waiting for Jenkins to finish collecting data
> [JENKINS] Archiving <https://builds.apache.org/job/xmlgraphics-fop/ws/fop-sandbox/pom.xml> to org.apache.xmlgraphics/fop-sandbox/2.4.0-SNAPSHOT/fop-sandbox-2.4.0-SNAPSHOT.pom
> [JENKINS] Archiving <https://builds.apache.org/job/xmlgraphics-fop/ws/fop-sandbox/target/fop-sandbox-2.4.0-SNAPSHOT.jar> to org.apache.xmlgraphics/fop-sandbox/2.4.0-SNAPSHOT/fop-sandbox-2.4.0-SNAPSHOT.jar
> [JENKINS] Archiving <https://builds.apache.org/job/xmlgraphics-fop/ws/pom.xml> to org.apache.xmlgraphics/fop-parent/2.4.0-SNAPSHOT/fop-parent-2.4.0-SNAPSHOT.pom
> [JENKINS] Archiving <https://builds.apache.org/job/xmlgraphics-fop/ws/fop-core/pom.xml> to org.apache.xmlgraphics/fop-core/2.4.0-SNAPSHOT/fop-core-2.4.0-SNAPSHOT.pom
> [JENKINS] Archiving <https://builds.apache.org/job/xmlgraphics-fop/ws/fop-core/target/fop-core-2.4.0-SNAPSHOT.jar> to org.apache.xmlgraphics/fop-core/2.4.0-SNAPSHOT/fop-core-2.4.0-SNAPSHOT.jar
> [JENKINS] Archiving <https://builds.apache.org/job/xmlgraphics-fop/ws/fop/pom.xml> to org.apache.xmlgraphics/fop/2.4.0-SNAPSHOT/fop-2.4.0-SNAPSHOT.pom
> [JENKINS] Archiving <https://builds.apache.org/job/xmlgraphics-fop/ws/fop/target/fop-2.4.0-SNAPSHOT.jar> to org.apache.xmlgraphics/fop/2.4.0-SNAPSHOT/fop-2.4.0-SNAPSHOT.jar
> [JENKINS] Archiving <https://builds.apache.org/job/xmlgraphics-fop/ws/fop-servlet/pom.xml> to org.apache.xmlgraphics/fop-servlet/2.4.0-SNAPSHOT/fop-servlet-2.4.0-SNAPSHOT.pom
> [JENKINS] Archiving <https://builds.apache.org/job/xmlgraphics-fop/ws/fop-servlet/target/fop-servlet-2.4.0-SNAPSHOT.war> to org.apache.xmlgraphics/fop-servlet/2.4.0-SNAPSHOT/fop-servlet-2.4.0-SNAPSHOT.war
> [JENKINS] Archiving <https://builds.apache.org/job/xmlgraphics-fop/ws/fop-transcoder-allinone/pom.xml> to org.apache.xmlgraphics/fop-transcoder-allinone/2.4.0-SNAPSHOT/fop-transcoder-allinone-2.4.0-SNAPSHOT.pom
> [JENKINS] Archiving <https://builds.apache.org/job/xmlgraphics-fop/ws/fop-transcoder-allinone/target/fop-transcoder-allinone-2.4.0-SNAPSHOT.jar> to org.apache.xmlgraphics/fop-transcoder-allinone/2.4.0-SNAPSHOT/fop-transcoder-allinone-2.4.0-SNAPSHOT.jar
> [JENKINS] Archiving <https://builds.apache.org/job/xmlgraphics-fop/ws/fop-util/pom.xml> to org.apache.xmlgraphics/fop-util/2.4.0-SNAPSHOT/fop-util-2.4.0-SNAPSHOT.pom
> [JENKINS] Archiving <https://builds.apache.org/job/xmlgraphics-fop/ws/fop-util/target/fop-util-2.4.0-SNAPSHOT.jar> to org.apache.xmlgraphics/fop-util/2.4.0-SNAPSHOT/fop-util-2.4.0-SNAPSHOT.jar
> [JENKINS] Archiving <https://builds.apache.org/job/xmlgraphics-fop/ws/fop-events/pom.xml> to org.apache.xmlgraphics/fop-events/2.4.0-SNAPSHOT/fop-events-2.4.0-SNAPSHOT.pom
> [JENKINS] Archiving <https://builds.apache.org/job/xmlgraphics-fop/ws/fop-events/target/fop-events-2.4.0-SNAPSHOT.jar> to org.apache.xmlgraphics/fop-events/2.4.0-SNAPSHOT/fop-events-2.4.0-SNAPSHOT.jar
> [JENKINS] Archiving <https://builds.apache.org/job/xmlgraphics-fop/ws/fop-transcoder/pom.xml> to org.apache.xmlgraphics/fop-transcoder/2.4.0-SNAPSHOT/fop-transcoder-2.4.0-SNAPSHOT.pom
> [JENKINS] Archiving <https://builds.apache.org/job/xmlgraphics-fop/ws/fop-transcoder/target/fop-transcoder-2.4.0-SNAPSHOT.jar> to org.apache.xmlgraphics/fop-transcoder/2.4.0-SNAPSHOT/fop-transcoder-2.4.0-SNAPSHOT.jar
> [CHECKSTYLE] Plug-in Result: Success - no threshold has been exceeded
> [CHECKSTYLE] Plug-in Result: Success - no threshold has been exceeded
> [CHECKSTYLE] Plug-in Result: Success - no threshold has been exceeded
> [CHECKSTYLE] Plug-in Result: Success - no threshold has been exceeded
> [FINDBUGS] Plug-in Result: Success - no threshold has been exceeded
> [FINDBUGS] Plug-in Result: Success - no threshold has been exceeded
> [FINDBUGS] Plug-in Result: Success - no threshold has been exceeded
> [FINDBUGS] Plug-in Result: Success - no threshold has been exceeded
> channel stopped
> Maven RedeployPublisher use remote ubuntu-1 maven settings from : /home/jenkins/.m2/settings.xml
> [INFO] Deployment in https://repository.apache.org/content/repositories/snapshots (id=apache.snapshots.https,uniqueVersion=true)
> Deploying the main artifact fop-2.4.0-SNAPSHOT.jar
> Downloading: https://repository.apache.org/content/repositories/snapshots/org/apache/xmlgraphics/fop/2.4.0-SNAPSHOT/maven-metadata.xml
> Downloaded: https://repository.apache.org/content/repositories/snapshots/org/apache/xmlgraphics/fop/2.4.0-SNAPSHOT/maven-metadata.xml (778 B at 0.9 KB/sec)
> Uploading: https://repository.apache.org/content/repositories/snapshots/org/apache/xmlgraphics/fop/2.4.0-SNAPSHOT/fop-2.4.0-20181010.204324-12.jar
> Uploading: https://repository.apache.org/content/repositories/snapshots/org/apache/xmlgraphics/fop/2.4.0-SNAPSHOT/fop-2.4.0-20181010.204324-12.pom
> ERROR: Failed to deploy artifacts: Could not transfer artifact org.apache.xmlgraphics:fop:jar:2.4.0-20181010.204324-12 from/to apache.snapshots.https (https://repository.apache.org/content/repositories/snapshots): Failed to transfer file: https://repository.apache.org/content/repositories/snapshots/org/apache/xmlgraphics/fop/2.4.0-SNAPSHOT/fop-2.4.0-20181010.204324-12.jar. Return code is: 401, ReasonPhrase: Unauthorized.
> org.apache.maven.artifact.deployer.ArtifactDeploymentException: Failed to deploy artifacts: Could not transfer artifact org.apache.xmlgraphics:fop:jar:2.4.0-20181010.204324-12 from/to apache.snapshots.https (https://repository.apache.org/content/repositories/snapshots): Failed to transfer file: https://repository.apache.org/content/repositories/snapshots/org/apache/xmlgraphics/fop/2.4.0-SNAPSHOT/fop-2.4.0-20181010.204324-12.jar. Return code is: 401, ReasonPhrase: Unauthorized.
> at org.apache.maven.artifact.deployer.DefaultArtifactDeployer.deploy(DefaultArtifactDeployer.java:143)
> at hudson.maven.reporters.MavenArtifactRecord.deploy(MavenArtifactRecord.java:193)
> at hudson.maven.RedeployPublisher.perform(RedeployPublisher.java:176)
> at hudson.tasks.BuildStepMonitor$1.perform(BuildStepMonitor.java:20)
> at hudson.model.AbstractBuild$AbstractBuildExecution.perform(AbstractBuild.java:744)
> at hudson.model.AbstractBuild$AbstractBuildExecution.performAllBuildSteps(AbstractBuild.java:690)
> at hudson.maven.MavenModuleSetBuild$MavenModuleSetBuildExecution.post2(MavenModuleSetBuild.java:1073)
> at hudson.model.AbstractBuild$AbstractBuildExecution.post(AbstractBuild.java:635)
> at hudson.model.Run.execute(Run.java:1819)
> at hudson.maven.MavenModuleSetBuild.run(MavenModuleSetBuild.java:543)
> at hudson.model.ResourceController.execute(ResourceController.java:97)
> at hudson.model.Executor.run(Executor.java:429)
> Caused by: org.eclipse.aether.deployment.DeploymentException: Failed to deploy artifacts: Could not transfer artifact org.apache.xmlgraphics:fop:jar:2.4.0-20181010.204324-12 from/to apache.snapshots.https (https://repository.apache.org/content/repositories/snapshots): Failed to transfer file: https://repository.apache.org/content/repositories/snapshots/org/apache/xmlgraphics/fop/2.4.0-SNAPSHOT/fop-2.4.0-20181010.204324-12.jar. Return code is: 401, ReasonPhrase: Unauthorized.
> at org.eclipse.aether.internal.impl.DefaultDeployer.deploy(DefaultDeployer.java:317)
> at org.eclipse.aether.internal.impl.DefaultDeployer.deploy(DefaultDeployer.java:245)
> at org.eclipse.aether.internal.impl.DefaultRepositorySystem.deploy(DefaultRepositorySystem.java:420)
> at org.apache.maven.artifact.deployer.DefaultArtifactDeployer.deploy(DefaultArtifactDeployer.java:139)
> ... 11 more
> Caused by: org.eclipse.aether.transfer.ArtifactTransferException: Could not transfer artifact org.apache.xmlgraphics:fop:jar:2.4.0-20181010.204324-12 from/to apache.snapshots.https (https://repository.apache.org/content/repositories/snapshots): Failed to transfer file: https://repository.apache.org/content/repositories/snapshots/org/apache/xmlgraphics/fop/2.4.0-SNAPSHOT/fop-2.4.0-20181010.204324-12.jar. Return code is: 401, ReasonPhrase: Unauthorized.
> at org.eclipse.aether.connector.basic.ArtifactTransportListener.transferFailed(ArtifactTransportListener.java:43)
> at org.eclipse.aether.connector.basic.BasicRepositoryConnector$TaskRunner.run(BasicRepositoryConnector.java:355)
> at org.eclipse.aether.connector.basic.BasicRepositoryConnector.put(BasicRepositoryConnector.java:274)
> at org.eclipse.aether.internal.impl.DefaultDeployer.deploy(DefaultDeployer.java:311)
> ... 14 more
> Caused by: org.apache.maven.wagon.TransferFailedException: Failed to transfer file: https://repository.apache.org/content/repositories/snapshots/org/apache/xmlgraphics/fop/2.4.0-SNAPSHOT/fop-2.4.0-20181010.204324-12.jar. Return code is: 401, ReasonPhrase: Unauthorized.
> at org.apache.maven.wagon.shared.http.AbstractHttpClientWagon.put(AbstractHttpClientWagon.java:635)
> at org.apache.maven.wagon.shared.http.AbstractHttpClientWagon.put(AbstractHttpClientWagon.java:557)
> at org.apache.maven.wagon.shared.http.AbstractHttpClientWagon.put(AbstractHttpClientWagon.java:539)
> at org.apache.maven.wagon.shared.http.AbstractHttpClientWagon.put(AbstractHttpClientWagon.java:533)
> at org.apache.maven.wagon.shared.http.AbstractHttpClientWagon.put(AbstractHttpClientWagon.java:513)
> at org.eclipse.aether.transport.wagon.WagonTransporter$PutTaskRunner.run(WagonTransporter.java:644)
> at org.eclipse.aether.transport.wagon.WagonTransporter.execute(WagonTransporter.java:427)
> at org.eclipse.aether.transport.wagon.WagonTransporter.put(WagonTransporter.java:410)
> at org.eclipse.aether.connector.basic.BasicRepositoryConnector$PutTaskRunner.runTask(BasicRepositoryConnector.java:510)
> at org.eclipse.aether.connector.basic.BasicRepositoryConnector$TaskRunner.run(BasicRepositoryConnector.java:350)
> ... 16 more
> [INFO] Deployment failed after 3.9 sec
> Build step 'Deploy artifacts to Maven repository' changed build result to FAILURE

Reply | Threaded
Open this post in threaded view
|

Build failed in Jenkins: xmlgraphics-fop #219

Apache Jenkins Server
In reply to this post by Apache Jenkins Server
See <https://builds.apache.org/job/xmlgraphics-fop/219/display/redirect>

------------------------------------------
[...truncated 112.70 KB...]
Downloading: https://repository.jboss.org/nexus/content/repositories/thirdparty-releases/org/apache/xmlgraphics/batik-ttf2svg/1.11.0-SNAPSHOT/maven-metadata.xml
Downloading: https://repository.apache.org/content/repositories/snapshots/org/apache/xmlgraphics/batik-ttf2svg/1.11.0-SNAPSHOT/maven-metadata.xml
[WARNING] Could not transfer metadata org.apache.xmlgraphics:batik-ttf2svg:1.11.0-SNAPSHOT/maven-metadata.xml from/to apache.snapshots.https (https://repository.apache.org/content/repositories/snapshots): Not authorized, ReasonPhrase:Unauthorized.
[INFO]
[INFO] --- maven-clean-plugin:2.4.1:clean (default-clean) @ fop-servlet ---
[INFO] Deleting <https://builds.apache.org/job/xmlgraphics-fop/ws/fop-servlet/target>
[INFO]
[INFO] --- maven-resources-plugin:2.5:resources (default-resources) @ fop-servlet ---
[debug] execute contextualize
[INFO] Using 'UTF-8' encoding to copy filtered resources.
[INFO] skip non existing resourceDirectory <https://builds.apache.org/job/xmlgraphics-fop/ws/fop-servlet/src/main/resources>
[INFO]
[INFO] --- maven-compiler-plugin:3.1:compile (default-compile) @ fop-servlet ---
[INFO] No sources to compile
[INFO]
[INFO] --- maven-resources-plugin:2.5:testResources (default-testResources) @ fop-servlet ---
[debug] execute contextualize
[INFO] Using 'UTF-8' encoding to copy filtered resources.
[INFO] skip non existing resourceDirectory <https://builds.apache.org/job/xmlgraphics-fop/ws/fop-servlet/src/test/resources>
[INFO]
[INFO] --- maven-compiler-plugin:3.1:testCompile (default-testCompile) @ fop-servlet ---
[INFO] No sources to compile
[INFO]
[INFO] --- maven-surefire-plugin:2.18.1:test (default-test) @ fop-servlet ---
[INFO] No tests to run.
[JENKINS] Recording test results
[INFO]
[INFO] --- maven-war-plugin:2.2:war (default-war) @ fop-servlet ---
[INFO] Packaging webapp
[INFO] Assembling webapp [fop-servlet] in [<https://builds.apache.org/job/xmlgraphics-fop/ws/fop-servlet/target/fop-servlet-2.4.0-SNAPSHOT]>
[INFO] Processing war project
[INFO] Copying webapp resources [<https://builds.apache.org/job/xmlgraphics-fop/ws/fop-servlet/src/main/webapp]>
[INFO] Webapp assembled in [112 msecs]
[INFO] Building war: <https://builds.apache.org/job/xmlgraphics-fop/ws/fop-servlet/target/fop-servlet-2.4.0-SNAPSHOT.war>
[INFO]
[INFO] --- maven-install-plugin:2.3.1:install (default-install) @ fop-servlet ---
[INFO] Installing <https://builds.apache.org/job/xmlgraphics-fop/ws/fop-servlet/target/fop-servlet-2.4.0-SNAPSHOT.war> to /home/jenkins/jenkins-slave/maven-repositories/1/org/apache/xmlgraphics/fop-servlet/2.4.0-SNAPSHOT/fop-servlet-2.4.0-SNAPSHOT.war
[INFO] Installing <https://builds.apache.org/job/xmlgraphics-fop/ws/fop-servlet/pom.xml> to /home/jenkins/jenkins-slave/maven-repositories/1/org/apache/xmlgraphics/fop-servlet/2.4.0-SNAPSHOT/fop-servlet-2.4.0-SNAPSHOT.pom
[INFO]
[INFO] --- maven-checkstyle-plugin:2.14:checkstyle (default-cli) @ fop-servlet ---
[CHECKSTYLE] No report found for mojo checkstyle
[INFO]
[INFO] --- findbugs-maven-plugin:3.0.5:findbugs (default-cli) @ fop-servlet ---
[FINDBUGS] No report found for mojo findbugs
[INFO]                                                                        
[INFO] ------------------------------------------------------------------------
[INFO] Building Apache FOP Transcoder 2.4.0-SNAPSHOT
[INFO] ------------------------------------------------------------------------
[INFO]
[INFO] --- maven-clean-plugin:2.4.1:clean (default-clean) @ fop-transcoder ---
[INFO] Deleting <https://builds.apache.org/job/xmlgraphics-fop/ws/fop-transcoder/target>
[INFO]
[INFO] --- maven-resources-plugin:2.5:resources (default-resources) @ fop-transcoder ---
[debug] execute contextualize
[INFO] Using 'UTF-8' encoding to copy filtered resources.
[INFO] skip non existing resourceDirectory <https://builds.apache.org/job/xmlgraphics-fop/ws/fop-transcoder/src/main/resources>
[INFO]
[INFO] --- maven-compiler-plugin:3.1:compile (default-compile) @ fop-transcoder ---
[INFO] No sources to compile
[INFO]
[INFO] --- maven-resources-plugin:2.5:testResources (default-testResources) @ fop-transcoder ---
[debug] execute contextualize
[INFO] Using 'UTF-8' encoding to copy filtered resources.
[INFO] skip non existing resourceDirectory <https://builds.apache.org/job/xmlgraphics-fop/ws/fop-transcoder/src/test/resources>
[INFO]
[INFO] --- maven-compiler-plugin:3.1:testCompile (default-testCompile) @ fop-transcoder ---
[INFO] No sources to compile
[INFO]
[INFO] --- maven-surefire-plugin:2.18.1:test (default-test) @ fop-transcoder ---
[INFO] No tests to run.
[JENKINS] Recording test results
[INFO]
[INFO] --- maven-jar-plugin:2.6:jar (default-jar) @ fop-transcoder ---
[WARNING] JAR will be empty - no content was marked for inclusion!
[INFO] Building jar: <https://builds.apache.org/job/xmlgraphics-fop/ws/fop-transcoder/target/fop-transcoder-2.4.0-SNAPSHOT.jar>
[INFO]
[INFO] --- maven-assembly-plugin:2.2-beta-5:single (package-all) @ fop-transcoder ---
[INFO] Reading assembly descriptor: src/tools/resources/assembly/assembly.xml
[WARNING] Artifact: org.apache.xmlgraphics:fop-transcoder:jar:2.4.0-SNAPSHOT references the same file as the assembly destination file. Moving it to a temporary location for inclusion.
[INFO] Building jar: <https://builds.apache.org/job/xmlgraphics-fop/ws/fop-transcoder/target/fop-transcoder-2.4.0-SNAPSHOT.jar>
[WARNING] Configuration options: 'appendAssemblyId' is set to false, and 'classifier' is missing.
Instead of attaching the assembly file: <https://builds.apache.org/job/xmlgraphics-fop/ws/fop-transcoder/target/fop-transcoder-2.4.0-SNAPSHOT.jar,> it will become the file for main project artifact.
NOTE: If multiple descriptors or descriptor-formats are provided for this project, the value of this file will be non-deterministic!
[WARNING] Replacing pre-existing project main-artifact file: <https://builds.apache.org/job/xmlgraphics-fop/ws/fop-transcoder/target/archive-tmp/fop-transcoder-2.4.0-SNAPSHOT.jar>
with assembly file: <https://builds.apache.org/job/xmlgraphics-fop/ws/fop-transcoder/target/fop-transcoder-2.4.0-SNAPSHOT.jar>
[INFO]
[INFO] --- maven-install-plugin:2.3.1:install (default-install) @ fop-transcoder ---
[INFO] Installing <https://builds.apache.org/job/xmlgraphics-fop/ws/fop-transcoder/target/fop-transcoder-2.4.0-SNAPSHOT.jar> to /home/jenkins/jenkins-slave/maven-repositories/1/org/apache/xmlgraphics/fop-transcoder/2.4.0-SNAPSHOT/fop-transcoder-2.4.0-SNAPSHOT.jar
[INFO] Installing <https://builds.apache.org/job/xmlgraphics-fop/ws/fop-transcoder/pom.xml> to /home/jenkins/jenkins-slave/maven-repositories/1/org/apache/xmlgraphics/fop-transcoder/2.4.0-SNAPSHOT/fop-transcoder-2.4.0-SNAPSHOT.pom
[INFO]
[INFO] --- maven-checkstyle-plugin:2.14:checkstyle (default-cli) @ fop-transcoder ---
[CHECKSTYLE] No report found for mojo checkstyle
[INFO]
[INFO] --- findbugs-maven-plugin:3.0.5:findbugs (default-cli) @ fop-transcoder ---
[FINDBUGS] No report found for mojo findbugs
[INFO]                                                                        
[INFO] ------------------------------------------------------------------------
[INFO] Building Apache FOP Transcoder All-In-One 2.4.0-SNAPSHOT
[INFO] ------------------------------------------------------------------------
[INFO]
[INFO] --- maven-clean-plugin:2.4.1:clean (default-clean) @ fop-transcoder-allinone ---
[INFO] Deleting <https://builds.apache.org/job/xmlgraphics-fop/ws/fop-transcoder-allinone/target>
[INFO]
[INFO] --- maven-resources-plugin:2.5:resources (default-resources) @ fop-transcoder-allinone ---
[debug] execute contextualize
[INFO] Using 'UTF-8' encoding to copy filtered resources.
[INFO] skip non existing resourceDirectory <https://builds.apache.org/job/xmlgraphics-fop/ws/fop-transcoder-allinone/src/main/resources>
[INFO]
[INFO] --- maven-compiler-plugin:3.1:compile (default-compile) @ fop-transcoder-allinone ---
[INFO] No sources to compile
[INFO]
[INFO] --- maven-resources-plugin:2.5:testResources (default-testResources) @ fop-transcoder-allinone ---
[debug] execute contextualize
[INFO] Using 'UTF-8' encoding to copy filtered resources.
[INFO] skip non existing resourceDirectory <https://builds.apache.org/job/xmlgraphics-fop/ws/fop-transcoder-allinone/src/test/resources>
[INFO]
[INFO] --- maven-compiler-plugin:3.1:testCompile (default-testCompile) @ fop-transcoder-allinone ---
[INFO] No sources to compile
[INFO]
[INFO] --- maven-surefire-plugin:2.18.1:test (default-test) @ fop-transcoder-allinone ---
[INFO] No tests to run.
[JENKINS] Recording test results
[INFO]
[INFO] --- maven-jar-plugin:2.6:jar (default-jar) @ fop-transcoder-allinone ---
[WARNING] JAR will be empty - no content was marked for inclusion!
[INFO] Building jar: <https://builds.apache.org/job/xmlgraphics-fop/ws/fop-transcoder-allinone/target/fop-transcoder-allinone-2.4.0-SNAPSHOT.jar>
[INFO]
[INFO] --- maven-assembly-plugin:2.2-beta-5:single (package-all) @ fop-transcoder-allinone ---
[INFO] Reading assembly descriptor: src/tools/resources/assembly/assembly.xml
[WARNING] Artifact: org.apache.xmlgraphics:fop-transcoder-allinone:jar:2.4.0-SNAPSHOT references the same file as the assembly destination file. Moving it to a temporary location for inclusion.
[INFO] org/apache/avalon/framework/component/ already added, skipping
[INFO] org/apache/avalon/framework/configuration/ already added, skipping
[INFO] org/apache/avalon/framework/context/ already added, skipping
[INFO] org/apache/avalon/framework/logger/ already added, skipping
[INFO] org/apache/avalon/framework/service/ already added, skipping
[INFO] Building jar: <https://builds.apache.org/job/xmlgraphics-fop/ws/fop-transcoder-allinone/target/fop-transcoder-allinone-2.4.0-SNAPSHOT.jar>
[INFO] org/apache/avalon/framework/component/ already added, skipping
[INFO] org/apache/avalon/framework/configuration/ already added, skipping
[INFO] org/apache/avalon/framework/context/ already added, skipping
[INFO] org/apache/avalon/framework/logger/ already added, skipping
[INFO] org/apache/avalon/framework/service/ already added, skipping
[WARNING] Configuration options: 'appendAssemblyId' is set to false, and 'classifier' is missing.
Instead of attaching the assembly file: <https://builds.apache.org/job/xmlgraphics-fop/ws/fop-transcoder-allinone/target/fop-transcoder-allinone-2.4.0-SNAPSHOT.jar,> it will become the file for main project artifact.
NOTE: If multiple descriptors or descriptor-formats are provided for this project, the value of this file will be non-deterministic!
[WARNING] Replacing pre-existing project main-artifact file: <https://builds.apache.org/job/xmlgraphics-fop/ws/fop-transcoder-allinone/target/archive-tmp/fop-transcoder-allinone-2.4.0-SNAPSHOT.jar>
with assembly file: <https://builds.apache.org/job/xmlgraphics-fop/ws/fop-transcoder-allinone/target/fop-transcoder-allinone-2.4.0-SNAPSHOT.jar>
[INFO]
[INFO] --- maven-install-plugin:2.3.1:install (default-install) @ fop-transcoder-allinone ---
[INFO] Installing <https://builds.apache.org/job/xmlgraphics-fop/ws/fop-transcoder-allinone/target/fop-transcoder-allinone-2.4.0-SNAPSHOT.jar> to /home/jenkins/jenkins-slave/maven-repositories/1/org/apache/xmlgraphics/fop-transcoder-allinone/2.4.0-SNAPSHOT/fop-transcoder-allinone-2.4.0-SNAPSHOT.jar
[INFO] Installing <https://builds.apache.org/job/xmlgraphics-fop/ws/fop-transcoder-allinone/pom.xml> to /home/jenkins/jenkins-slave/maven-repositories/1/org/apache/xmlgraphics/fop-transcoder-allinone/2.4.0-SNAPSHOT/fop-transcoder-allinone-2.4.0-SNAPSHOT.pom
[INFO]
[INFO] --- maven-checkstyle-plugin:2.14:checkstyle (default-cli) @ fop-transcoder-allinone ---
[CHECKSTYLE] No report found for mojo checkstyle
[INFO]
[INFO] --- findbugs-maven-plugin:3.0.5:findbugs (default-cli) @ fop-transcoder-allinone ---
[FINDBUGS] No report found for mojo findbugs
[INFO] ------------------------------------------------------------------------
[INFO] Reactor Summary:
[INFO]
[INFO] Apache FOP Parent ................................. SUCCESS [18.446s]
[INFO] Apache FOP Utilities .............................. SUCCESS [2:24.007s]
[INFO] Apache FOP Events ................................. SUCCESS [22.167s]
[INFO] Apache FOP Core ................................... SUCCESS [4:26.009s]
[INFO] Apache FOP All-In-One ............................. SUCCESS [6.383s]
[INFO] Apache FOP Sandbox ................................ SUCCESS [14.158s]
[INFO] Apache FOP Servlet ................................ SUCCESS [13.823s]
[INFO] Apache FOP Transcoder ............................. SUCCESS [4.806s]
[INFO] Apache FOP Transcoder All-In-One .................. SUCCESS [4.893s]
[INFO] ------------------------------------------------------------------------
[INFO] BUILD SUCCESS
[INFO] ------------------------------------------------------------------------
[INFO] Total time: 8:50.615s
[INFO] Finished at: Thu Oct 11 07:32:14 UTC 2018
[INFO] Final Memory: 83M/4050M
[INFO] ------------------------------------------------------------------------
Waiting for Jenkins to finish collecting data
[JENKINS] Archiving <https://builds.apache.org/job/xmlgraphics-fop/ws/fop-sandbox/pom.xml> to org.apache.xmlgraphics/fop-sandbox/2.4.0-SNAPSHOT/fop-sandbox-2.4.0-SNAPSHOT.pom
[JENKINS] Archiving <https://builds.apache.org/job/xmlgraphics-fop/ws/fop-sandbox/target/fop-sandbox-2.4.0-SNAPSHOT.jar> to org.apache.xmlgraphics/fop-sandbox/2.4.0-SNAPSHOT/fop-sandbox-2.4.0-SNAPSHOT.jar
[JENKINS] Archiving <https://builds.apache.org/job/xmlgraphics-fop/ws/pom.xml> to org.apache.xmlgraphics/fop-parent/2.4.0-SNAPSHOT/fop-parent-2.4.0-SNAPSHOT.pom
[JENKINS] Archiving <https://builds.apache.org/job/xmlgraphics-fop/ws/fop-core/pom.xml> to org.apache.xmlgraphics/fop-core/2.4.0-SNAPSHOT/fop-core-2.4.0-SNAPSHOT.pom
[JENKINS] Archiving <https://builds.apache.org/job/xmlgraphics-fop/ws/fop-core/target/fop-core-2.4.0-SNAPSHOT.jar> to org.apache.xmlgraphics/fop-core/2.4.0-SNAPSHOT/fop-core-2.4.0-SNAPSHOT.jar
[JENKINS] Archiving <https://builds.apache.org/job/xmlgraphics-fop/ws/fop/pom.xml> to org.apache.xmlgraphics/fop/2.4.0-SNAPSHOT/fop-2.4.0-SNAPSHOT.pom
[JENKINS] Archiving <https://builds.apache.org/job/xmlgraphics-fop/ws/fop/target/fop-2.4.0-SNAPSHOT.jar> to org.apache.xmlgraphics/fop/2.4.0-SNAPSHOT/fop-2.4.0-SNAPSHOT.jar
[JENKINS] Archiving <https://builds.apache.org/job/xmlgraphics-fop/ws/fop-servlet/pom.xml> to org.apache.xmlgraphics/fop-servlet/2.4.0-SNAPSHOT/fop-servlet-2.4.0-SNAPSHOT.pom
[JENKINS] Archiving <https://builds.apache.org/job/xmlgraphics-fop/ws/fop-servlet/target/fop-servlet-2.4.0-SNAPSHOT.war> to org.apache.xmlgraphics/fop-servlet/2.4.0-SNAPSHOT/fop-servlet-2.4.0-SNAPSHOT.war
[JENKINS] Archiving <https://builds.apache.org/job/xmlgraphics-fop/ws/fop-transcoder-allinone/pom.xml> to org.apache.xmlgraphics/fop-transcoder-allinone/2.4.0-SNAPSHOT/fop-transcoder-allinone-2.4.0-SNAPSHOT.pom
[JENKINS] Archiving <https://builds.apache.org/job/xmlgraphics-fop/ws/fop-transcoder-allinone/target/fop-transcoder-allinone-2.4.0-SNAPSHOT.jar> to org.apache.xmlgraphics/fop-transcoder-allinone/2.4.0-SNAPSHOT/fop-transcoder-allinone-2.4.0-SNAPSHOT.jar
[JENKINS] Archiving <https://builds.apache.org/job/xmlgraphics-fop/ws/fop-util/pom.xml> to org.apache.xmlgraphics/fop-util/2.4.0-SNAPSHOT/fop-util-2.4.0-SNAPSHOT.pom
[JENKINS] Archiving <https://builds.apache.org/job/xmlgraphics-fop/ws/fop-util/target/fop-util-2.4.0-SNAPSHOT.jar> to org.apache.xmlgraphics/fop-util/2.4.0-SNAPSHOT/fop-util-2.4.0-SNAPSHOT.jar
[JENKINS] Archiving <https://builds.apache.org/job/xmlgraphics-fop/ws/fop-events/pom.xml> to org.apache.xmlgraphics/fop-events/2.4.0-SNAPSHOT/fop-events-2.4.0-SNAPSHOT.pom
[JENKINS] Archiving <https://builds.apache.org/job/xmlgraphics-fop/ws/fop-events/target/fop-events-2.4.0-SNAPSHOT.jar> to org.apache.xmlgraphics/fop-events/2.4.0-SNAPSHOT/fop-events-2.4.0-SNAPSHOT.jar
[JENKINS] Archiving <https://builds.apache.org/job/xmlgraphics-fop/ws/fop-transcoder/pom.xml> to org.apache.xmlgraphics/fop-transcoder/2.4.0-SNAPSHOT/fop-transcoder-2.4.0-SNAPSHOT.pom
[JENKINS] Archiving <https://builds.apache.org/job/xmlgraphics-fop/ws/fop-transcoder/target/fop-transcoder-2.4.0-SNAPSHOT.jar> to org.apache.xmlgraphics/fop-transcoder/2.4.0-SNAPSHOT/fop-transcoder-2.4.0-SNAPSHOT.jar
[CHECKSTYLE] Plug-in Result: Success - no threshold has been exceeded
[CHECKSTYLE] Plug-in Result: Success - no threshold has been exceeded
[CHECKSTYLE] Plug-in Result: Success - no threshold has been exceeded
[CHECKSTYLE] Plug-in Result: Success - no threshold has been exceeded
[FINDBUGS] Plug-in Result: Success - no threshold has been exceeded
[FINDBUGS] Plug-in Result: Success - no threshold has been exceeded
[FINDBUGS] Plug-in Result: Success - no threshold has been exceeded
[FINDBUGS] Plug-in Result: Success - no threshold has been exceeded
channel stopped
Maven RedeployPublisher use remote ubuntu-1 maven settings from : /home/jenkins/.m2/settings.xml
[INFO] Deployment in https://repository.apache.org/content/repositories/snapshots (id=apache.snapshots.https,uniqueVersion=true)
Deploying the main artifact fop-2.4.0-SNAPSHOT.jar
Downloading: https://repository.apache.org/content/repositories/snapshots/org/apache/xmlgraphics/fop/2.4.0-SNAPSHOT/maven-metadata.xml
Downloaded: https://repository.apache.org/content/repositories/snapshots/org/apache/xmlgraphics/fop/2.4.0-SNAPSHOT/maven-metadata.xml (778 B at 0.9 KB/sec)
Uploading: https://repository.apache.org/content/repositories/snapshots/org/apache/xmlgraphics/fop/2.4.0-SNAPSHOT/fop-2.4.0-20181011.073238-12.jar
Uploading: https://repository.apache.org/content/repositories/snapshots/org/apache/xmlgraphics/fop/2.4.0-SNAPSHOT/fop-2.4.0-20181011.073238-12.pom
ERROR: Failed to deploy artifacts: Could not transfer artifact org.apache.xmlgraphics:fop:jar:2.4.0-20181011.073238-12 from/to apache.snapshots.https (https://repository.apache.org/content/repositories/snapshots): Failed to transfer file: https://repository.apache.org/content/repositories/snapshots/org/apache/xmlgraphics/fop/2.4.0-SNAPSHOT/fop-2.4.0-20181011.073238-12.jar. Return code is: 401, ReasonPhrase: Unauthorized.
org.apache.maven.artifact.deployer.ArtifactDeploymentException: Failed to deploy artifacts: Could not transfer artifact org.apache.xmlgraphics:fop:jar:2.4.0-20181011.073238-12 from/to apache.snapshots.https (https://repository.apache.org/content/repositories/snapshots): Failed to transfer file: https://repository.apache.org/content/repositories/snapshots/org/apache/xmlgraphics/fop/2.4.0-SNAPSHOT/fop-2.4.0-20181011.073238-12.jar. Return code is: 401, ReasonPhrase: Unauthorized.
        at org.apache.maven.artifact.deployer.DefaultArtifactDeployer.deploy(DefaultArtifactDeployer.java:143)
        at hudson.maven.reporters.MavenArtifactRecord.deploy(MavenArtifactRecord.java:193)
        at hudson.maven.RedeployPublisher.perform(RedeployPublisher.java:176)
        at hudson.tasks.BuildStepMonitor$1.perform(BuildStepMonitor.java:20)
        at hudson.model.AbstractBuild$AbstractBuildExecution.perform(AbstractBuild.java:744)
        at hudson.model.AbstractBuild$AbstractBuildExecution.performAllBuildSteps(AbstractBuild.java:690)
        at hudson.maven.MavenModuleSetBuild$MavenModuleSetBuildExecution.post2(MavenModuleSetBuild.java:1073)
        at hudson.model.AbstractBuild$AbstractBuildExecution.post(AbstractBuild.java:635)
        at hudson.model.Run.execute(Run.java:1819)
        at hudson.maven.MavenModuleSetBuild.run(MavenModuleSetBuild.java:543)
        at hudson.model.ResourceController.execute(ResourceController.java:97)
        at hudson.model.Executor.run(Executor.java:429)
Caused by: org.eclipse.aether.deployment.DeploymentException: Failed to deploy artifacts: Could not transfer artifact org.apache.xmlgraphics:fop:jar:2.4.0-20181011.073238-12 from/to apache.snapshots.https (https://repository.apache.org/content/repositories/snapshots): Failed to transfer file: https://repository.apache.org/content/repositories/snapshots/org/apache/xmlgraphics/fop/2.4.0-SNAPSHOT/fop-2.4.0-20181011.073238-12.jar. Return code is: 401, ReasonPhrase: Unauthorized.
        at org.eclipse.aether.internal.impl.DefaultDeployer.deploy(DefaultDeployer.java:317)
        at org.eclipse.aether.internal.impl.DefaultDeployer.deploy(DefaultDeployer.java:245)
        at org.eclipse.aether.internal.impl.DefaultRepositorySystem.deploy(DefaultRepositorySystem.java:420)
        at org.apache.maven.artifact.deployer.DefaultArtifactDeployer.deploy(DefaultArtifactDeployer.java:139)
        ... 11 more
Caused by: org.eclipse.aether.transfer.ArtifactTransferException: Could not transfer artifact org.apache.xmlgraphics:fop:jar:2.4.0-20181011.073238-12 from/to apache.snapshots.https (https://repository.apache.org/content/repositories/snapshots): Failed to transfer file: https://repository.apache.org/content/repositories/snapshots/org/apache/xmlgraphics/fop/2.4.0-SNAPSHOT/fop-2.4.0-20181011.073238-12.jar. Return code is: 401, ReasonPhrase: Unauthorized.
        at org.eclipse.aether.connector.basic.ArtifactTransportListener.transferFailed(ArtifactTransportListener.java:43)
        at org.eclipse.aether.connector.basic.BasicRepositoryConnector$TaskRunner.run(BasicRepositoryConnector.java:355)
        at org.eclipse.aether.connector.basic.BasicRepositoryConnector.put(BasicRepositoryConnector.java:274)
        at org.eclipse.aether.internal.impl.DefaultDeployer.deploy(DefaultDeployer.java:311)
        ... 14 more
Caused by: org.apache.maven.wagon.TransferFailedException: Failed to transfer file: https://repository.apache.org/content/repositories/snapshots/org/apache/xmlgraphics/fop/2.4.0-SNAPSHOT/fop-2.4.0-20181011.073238-12.jar. Return code is: 401, ReasonPhrase: Unauthorized.
        at org.apache.maven.wagon.shared.http.AbstractHttpClientWagon.put(AbstractHttpClientWagon.java:635)
        at org.apache.maven.wagon.shared.http.AbstractHttpClientWagon.put(AbstractHttpClientWagon.java:557)
        at org.apache.maven.wagon.shared.http.AbstractHttpClientWagon.put(AbstractHttpClientWagon.java:539)
        at org.apache.maven.wagon.shared.http.AbstractHttpClientWagon.put(AbstractHttpClientWagon.java:533)
        at org.apache.maven.wagon.shared.http.AbstractHttpClientWagon.put(AbstractHttpClientWagon.java:513)
        at org.eclipse.aether.transport.wagon.WagonTransporter$PutTaskRunner.run(WagonTransporter.java:644)
        at org.eclipse.aether.transport.wagon.WagonTransporter.execute(WagonTransporter.java:427)
        at org.eclipse.aether.transport.wagon.WagonTransporter.put(WagonTransporter.java:410)
        at org.eclipse.aether.connector.basic.BasicRepositoryConnector$PutTaskRunner.runTask(BasicRepositoryConnector.java:510)
        at org.eclipse.aether.connector.basic.BasicRepositoryConnector$TaskRunner.run(BasicRepositoryConnector.java:350)
        ... 16 more
[INFO] Deployment failed after 3.8 sec
Build step 'Deploy artifacts to Maven repository' changed build result to FAILURE
Reply | Threaded
Open this post in threaded view
|

RE: Build failed in Jenkins: xmlgraphics-fop #218

Simon Steiner
In reply to this post by Matthias Reischenbacher
Hi,

This is maybe due to the slave machine its running on having an issue.

Thanks

-----Original Message-----
From: Matthias Reischenbacher <[hidden email]>
Sent: 10 October 2018 21:47
To: [hidden email]
Subject: Re: Build failed in Jenkins: xmlgraphics-fop #218

Hi team,

is the "Return code is: 401, ReasonPhrase: Unauthorized." error related to the fact, that I'm committing and missing some access rights? Or is this just a temporary repository server issue?

Best regards,

Matthias


On 10.10.2018 17:43, Apache Jenkins Server wrote:

> See
> <https://builds.apache.org/job/xmlgraphics-fop/218/display/redirect?pa
> ge=changes>
>
> Changes:
>
> [matthias] FOP-2818: fix failing test
>
> ------------------------------------------
> [...truncated 112.41 KB...]
> Downloading:
> https://repository.apache.org/content/repositories/snapshots/org/apach
> e/xmlgraphics/batik-ttf2svg/1.11.0-SNAPSHOT/maven-metadata.xml
> Downloading:
> https://repository.jboss.org/nexus/content/repositories/thirdparty-rel
> eases/org/apache/xmlgraphics/batik-ttf2svg/1.11.0-SNAPSHOT/maven-metad
> ata.xml [WARNING] Could not transfer metadata
> org.apache.xmlgraphics:batik-ttf2svg:1.11.0-SNAPSHOT/maven-metadata.xml from/to apache.snapshots.https (https://repository.apache.org/content/repositories/snapshots): Not authorized, ReasonPhrase:Unauthorized.
> [INFO]
> [INFO] --- maven-clean-plugin:2.4.1:clean (default-clean) @
> fop-servlet --- [INFO] Deleting
> <https://builds.apache.org/job/xmlgraphics-fop/ws/fop-servlet/target>
> [INFO]
> [INFO] --- maven-resources-plugin:2.5:resources (default-resources) @
> fop-servlet --- [debug] execute contextualize [INFO] Using 'UTF-8'
> encoding to copy filtered resources.
> [INFO] skip non existing resourceDirectory
> <https://builds.apache.org/job/xmlgraphics-fop/ws/fop-servlet/src/main
> /resources>
> [INFO]
> [INFO] --- maven-compiler-plugin:3.1:compile (default-compile) @
> fop-servlet --- [INFO] No sources to compile [INFO] [INFO] ---
> maven-resources-plugin:2.5:testResources (default-testResources) @
> fop-servlet --- [debug] execute contextualize [INFO] Using 'UTF-8'
> encoding to copy filtered resources.
> [INFO] skip non existing resourceDirectory
> <https://builds.apache.org/job/xmlgraphics-fop/ws/fop-servlet/src/test
> /resources>
> [INFO]
> [INFO] --- maven-compiler-plugin:3.1:testCompile (default-testCompile)
> @ fop-servlet --- [INFO] No sources to compile [INFO] [INFO] ---
> maven-surefire-plugin:2.18.1:test (default-test) @ fop-servlet ---
> [INFO] No tests to run.
> [JENKINS] Recording test results
> [INFO]
> [INFO] --- maven-war-plugin:2.2:war (default-war) @ fop-servlet ---
> [INFO] Packaging webapp [INFO] Assembling webapp [fop-servlet] in
> [<https://builds.apache.org/job/xmlgraphics-fop/ws/fop-servlet/target/
> fop-servlet-2.4.0-SNAPSHOT]>
> [INFO] Processing war project
> [INFO] Copying webapp resources
> [<https://builds.apache.org/job/xmlgraphics-fop/ws/fop-servlet/src/mai
> n/webapp]>
> [INFO] Webapp assembled in [97 msecs]
> [INFO] Building war:
> <https://builds.apache.org/job/xmlgraphics-fop/ws/fop-servlet/target/f
> op-servlet-2.4.0-SNAPSHOT.war>
> [INFO]
> [INFO] --- maven-install-plugin:2.3.1:install (default-install) @
> fop-servlet --- [INFO] Installing
> <https://builds.apache.org/job/xmlgraphics-fop/ws/fop-servlet/target/f
> op-servlet-2.4.0-SNAPSHOT.war> to
> /home/jenkins/jenkins-slave/maven-repositories/0/org/apache/xmlgraphic
> s/fop-servlet/2.4.0-SNAPSHOT/fop-servlet-2.4.0-SNAPSHOT.war
> [INFO] Installing
> <https://builds.apache.org/job/xmlgraphics-fop/ws/fop-servlet/pom.xml>
> to
> /home/jenkins/jenkins-slave/maven-repositories/0/org/apache/xmlgraphic
> s/fop-servlet/2.4.0-SNAPSHOT/fop-servlet-2.4.0-SNAPSHOT.pom
> [INFO]
> [INFO] --- maven-checkstyle-plugin:2.14:checkstyle (default-cli) @
> fop-servlet --- [CHECKSTYLE] No report found for mojo checkstyle[INFO]
>
> [INFO] --- findbugs-maven-plugin:3.0.5:findbugs (default-cli) @
> fop-servlet --- [FINDBUGS] No report found for mojo findbugs
> [INFO]                                                                        
> [INFO]
> ----------------------------------------------------------------------
> -- [INFO] Building Apache FOP Transcoder 2.4.0-SNAPSHOT [INFO]
> ----------------------------------------------------------------------
> --
> [INFO]
> [INFO] --- maven-clean-plugin:2.4.1:clean (default-clean) @
> fop-transcoder --- [INFO] Deleting
> <https://builds.apache.org/job/xmlgraphics-fop/ws/fop-transcoder/targe
> t>
> [INFO]
> [INFO] --- maven-resources-plugin:2.5:resources (default-resources) @
> fop-transcoder --- [debug] execute contextualize [INFO] Using 'UTF-8'
> encoding to copy filtered resources.
> [INFO] skip non existing resourceDirectory
> <https://builds.apache.org/job/xmlgraphics-fop/ws/fop-transcoder/src/m
> ain/resources>
> [INFO]
> [INFO] --- maven-compiler-plugin:3.1:compile (default-compile) @
> fop-transcoder --- [INFO] No sources to compile [INFO] [INFO] ---
> maven-resources-plugin:2.5:testResources (default-testResources) @
> fop-transcoder --- [debug] execute contextualize [INFO] Using 'UTF-8'
> encoding to copy filtered resources.
> [INFO] skip non existing resourceDirectory
> <https://builds.apache.org/job/xmlgraphics-fop/ws/fop-transcoder/src/t
> est/resources>
> [INFO]
> [INFO] --- maven-compiler-plugin:3.1:testCompile (default-testCompile)
> @ fop-transcoder --- [INFO] No sources to compile [INFO] [INFO] ---
> maven-surefire-plugin:2.18.1:test (default-test) @ fop-transcoder ---
> [INFO] No tests to run.
> [JENKINS] Recording test results
> [INFO]
> [INFO] --- maven-jar-plugin:2.6:jar (default-jar) @ fop-transcoder ---
> [WARNING] JAR will be empty - no content was marked for inclusion!
> [INFO] Building jar:
> <https://builds.apache.org/job/xmlgraphics-fop/ws/fop-transcoder/targe
> t/fop-transcoder-2.4.0-SNAPSHOT.jar>
> [INFO]
> [INFO] --- maven-assembly-plugin:2.2-beta-5:single (package-all) @
> fop-transcoder --- [INFO] Reading assembly descriptor:
> src/tools/resources/assembly/assembly.xml
> [WARNING] Artifact: org.apache.xmlgraphics:fop-transcoder:jar:2.4.0-SNAPSHOT references the same file as the assembly destination file. Moving it to a temporary location for inclusion.
> [INFO] Building jar:
> <https://builds.apache.org/job/xmlgraphics-fop/ws/fop-transcoder/targe
> t/fop-transcoder-2.4.0-SNAPSHOT.jar>
> [WARNING] Configuration options: 'appendAssemblyId' is set to false, and 'classifier' is missing.
> Instead of attaching the assembly file: <https://builds.apache.org/job/xmlgraphics-fop/ws/fop-transcoder/target/fop-transcoder-2.4.0-SNAPSHOT.jar,> it will become the file for main project artifact.
> NOTE: If multiple descriptors or descriptor-formats are provided for this project, the value of this file will be non-deterministic!
> [WARNING] Replacing pre-existing project main-artifact file:
> <https://builds.apache.org/job/xmlgraphics-fop/ws/fop-transcoder/targe
> t/archive-tmp/fop-transcoder-2.4.0-SNAPSHOT.jar>
> with assembly file:
> <https://builds.apache.org/job/xmlgraphics-fop/ws/fop-transcoder/targe
> t/fop-transcoder-2.4.0-SNAPSHOT.jar>
> [INFO]
> [INFO] --- maven-install-plugin:2.3.1:install (default-install) @
> fop-transcoder --- [INFO] Installing
> <https://builds.apache.org/job/xmlgraphics-fop/ws/fop-transcoder/targe
> t/fop-transcoder-2.4.0-SNAPSHOT.jar> to
> /home/jenkins/jenkins-slave/maven-repositories/0/org/apache/xmlgraphic
> s/fop-transcoder/2.4.0-SNAPSHOT/fop-transcoder-2.4.0-SNAPSHOT.jar
> [INFO] Installing
> <https://builds.apache.org/job/xmlgraphics-fop/ws/fop-transcoder/pom.x
> ml> to
> /home/jenkins/jenkins-slave/maven-repositories/0/org/apache/xmlgraphic
> s/fop-transcoder/2.4.0-SNAPSHOT/fop-transcoder-2.4.0-SNAPSHOT.pom
> [INFO]
> [INFO] --- maven-checkstyle-plugin:2.14:checkstyle (default-cli) @
> fop-transcoder --- [CHECKSTYLE] No report found for mojo checkstyle
> [INFO] [INFO] --- findbugs-maven-plugin:3.0.5:findbugs (default-cli) @
> fop-transcoder --- [FINDBUGS] No report found for mojo findbugs
> [INFO]                                                                        
> [INFO]
> ----------------------------------------------------------------------
> -- [INFO] Building Apache FOP Transcoder All-In-One 2.4.0-SNAPSHOT
> [INFO]
> ----------------------------------------------------------------------
> --
> [INFO]
> [INFO] --- maven-clean-plugin:2.4.1:clean (default-clean) @
> fop-transcoder-allinone --- [INFO] Deleting
> <https://builds.apache.org/job/xmlgraphics-fop/ws/fop-transcoder-allin
> one/target>
> [INFO]
> [INFO] --- maven-resources-plugin:2.5:resources (default-resources) @
> fop-transcoder-allinone --- [debug] execute contextualize [INFO] Using
> 'UTF-8' encoding to copy filtered resources.
> [INFO] skip non existing resourceDirectory
> <https://builds.apache.org/job/xmlgraphics-fop/ws/fop-transcoder-allin
> one/src/main/resources>
> [INFO]
> [INFO] --- maven-compiler-plugin:3.1:compile (default-compile) @
> fop-transcoder-allinone --- [INFO] No sources to compile [INFO] [INFO]
> --- maven-resources-plugin:2.5:testResources (default-testResources) @
> fop-transcoder-allinone --- [debug] execute contextualize [INFO] Using
> 'UTF-8' encoding to copy filtered resources.
> [INFO] skip non existing resourceDirectory
> <https://builds.apache.org/job/xmlgraphics-fop/ws/fop-transcoder-allin
> one/src/test/resources>
> [INFO]
> [INFO] --- maven-compiler-plugin:3.1:testCompile (default-testCompile)
> @ fop-transcoder-allinone --- [INFO] No sources to compile [INFO]
> [INFO] --- maven-surefire-plugin:2.18.1:test (default-test) @
> fop-transcoder-allinone --- [INFO] No tests to run.
> [JENKINS] Recording test results
> [INFO]
> [INFO] --- maven-jar-plugin:2.6:jar (default-jar) @
> fop-transcoder-allinone --- [WARNING] JAR will be empty - no content was marked for inclusion!
> [INFO] Building jar:
> <https://builds.apache.org/job/xmlgraphics-fop/ws/fop-transcoder-allin
> one/target/fop-transcoder-allinone-2.4.0-SNAPSHOT.jar>
> [INFO]
> [INFO] --- maven-assembly-plugin:2.2-beta-5:single (package-all) @
> fop-transcoder-allinone --- [INFO] Reading assembly descriptor:
> src/tools/resources/assembly/assembly.xml
> [WARNING] Artifact: org.apache.xmlgraphics:fop-transcoder-allinone:jar:2.4.0-SNAPSHOT references the same file as the assembly destination file. Moving it to a temporary location for inclusion.
> [INFO] org/apache/avalon/framework/component/ already added, skipping
> [INFO] org/apache/avalon/framework/configuration/ already added,
> skipping [INFO] org/apache/avalon/framework/context/ already added,
> skipping [INFO] org/apache/avalon/framework/logger/ already added,
> skipping [INFO] org/apache/avalon/framework/service/ already added,
> skipping [INFO] Building jar:
> <https://builds.apache.org/job/xmlgraphics-fop/ws/fop-transcoder-allin
> one/target/fop-transcoder-allinone-2.4.0-SNAPSHOT.jar>
> [INFO] org/apache/avalon/framework/component/ already added, skipping
> [INFO] org/apache/avalon/framework/configuration/ already added,
> skipping [INFO] org/apache/avalon/framework/context/ already added,
> skipping [INFO] org/apache/avalon/framework/logger/ already added,
> skipping [INFO] org/apache/avalon/framework/service/ already added,
> skipping [WARNING] Configuration options: 'appendAssemblyId' is set to false, and 'classifier' is missing.
> Instead of attaching the assembly file: <https://builds.apache.org/job/xmlgraphics-fop/ws/fop-transcoder-allinone/target/fop-transcoder-allinone-2.4.0-SNAPSHOT.jar,> it will become the file for main project artifact.
> NOTE: If multiple descriptors or descriptor-formats are provided for this project, the value of this file will be non-deterministic!
> [WARNING] Replacing pre-existing project main-artifact file:
> <https://builds.apache.org/job/xmlgraphics-fop/ws/fop-transcoder-allin
> one/target/archive-tmp/fop-transcoder-allinone-2.4.0-SNAPSHOT.jar>
> with assembly file:
> <https://builds.apache.org/job/xmlgraphics-fop/ws/fop-transcoder-allin
> one/target/fop-transcoder-allinone-2.4.0-SNAPSHOT.jar>
> [INFO]
> [INFO] --- maven-install-plugin:2.3.1:install (default-install) @
> fop-transcoder-allinone --- [INFO] Installing
> <https://builds.apache.org/job/xmlgraphics-fop/ws/fop-transcoder-allin
> one/target/fop-transcoder-allinone-2.4.0-SNAPSHOT.jar> to
> /home/jenkins/jenkins-slave/maven-repositories/0/org/apache/xmlgraphic
> s/fop-transcoder-allinone/2.4.0-SNAPSHOT/fop-transcoder-allinone-2.4.0
> -SNAPSHOT.jar [INFO] Installing
> <https://builds.apache.org/job/xmlgraphics-fop/ws/fop-transcoder-allin
> one/pom.xml> to
> /home/jenkins/jenkins-slave/maven-repositories/0/org/apache/xmlgraphic
> s/fop-transcoder-allinone/2.4.0-SNAPSHOT/fop-transcoder-allinone-2.4.0
> -SNAPSHOT.pom
> [INFO]
> [INFO] --- maven-checkstyle-plugin:2.14:checkstyle (default-cli) @
> fop-transcoder-allinone --- [CHECKSTYLE] No report found for mojo
> checkstyle[INFO]
>
> [INFO] --- findbugs-maven-plugin:3.0.5:findbugs (default-cli) @
> fop-transcoder-allinone --- [FINDBUGS] No report found for mojo
> findbugs [INFO]
> ----------------------------------------------------------------------
> --
> [INFO] Reactor Summary:
> [INFO]
> [INFO] Apache FOP Parent ................................. SUCCESS
> [17.565s] [INFO] Apache FOP Utilities ..............................
> SUCCESS [2:15.040s] [INFO] Apache FOP Events
> ................................. SUCCESS [20.467s] [INFO] Apache FOP
> Core ................................... SUCCESS [4:13.689s] [INFO]
> Apache FOP All-In-One ............................. SUCCESS [6.379s]
> [INFO] Apache FOP Sandbox ................................ SUCCESS
> [13.631s] [INFO] Apache FOP Servlet ................................
> SUCCESS [15.966s] [INFO] Apache FOP Transcoder
> ............................. SUCCESS [4.400s] [INFO] Apache FOP
> Transcoder All-In-One .................. SUCCESS [4.500s] [INFO]
> ----------------------------------------------------------------------
> --
> [INFO] BUILD SUCCESS
> [INFO]
> ----------------------------------------------------------------------
> --
> [INFO] Total time: 8:26.395s
> [INFO] Finished at: Wed Oct 10 20:43:01 UTC 2018 [INFO] Final Memory:
> 83M/4051M [INFO]
> ----------------------------------------------------------------------
> -- Waiting for Jenkins to finish collecting data [JENKINS] Archiving
> <https://builds.apache.org/job/xmlgraphics-fop/ws/fop-sandbox/pom.xml>
> to
> org.apache.xmlgraphics/fop-sandbox/2.4.0-SNAPSHOT/fop-sandbox-2.4.0-SN
> APSHOT.pom [JENKINS] Archiving
> <https://builds.apache.org/job/xmlgraphics-fop/ws/fop-sandbox/target/f
> op-sandbox-2.4.0-SNAPSHOT.jar> to
> org.apache.xmlgraphics/fop-sandbox/2.4.0-SNAPSHOT/fop-sandbox-2.4.0-SN
> APSHOT.jar [JENKINS] Archiving
> <https://builds.apache.org/job/xmlgraphics-fop/ws/pom.xml> to
> org.apache.xmlgraphics/fop-parent/2.4.0-SNAPSHOT/fop-parent-2.4.0-SNAP
> SHOT.pom [JENKINS] Archiving
> <https://builds.apache.org/job/xmlgraphics-fop/ws/fop-core/pom.xml> to
> org.apache.xmlgraphics/fop-core/2.4.0-SNAPSHOT/fop-core-2.4.0-SNAPSHOT
> .pom [JENKINS] Archiving
> <https://builds.apache.org/job/xmlgraphics-fop/ws/fop-core/target/fop-
> core-2.4.0-SNAPSHOT.jar> to
> org.apache.xmlgraphics/fop-core/2.4.0-SNAPSHOT/fop-core-2.4.0-SNAPSHOT
> .jar [JENKINS] Archiving
> <https://builds.apache.org/job/xmlgraphics-fop/ws/fop/pom.xml> to
> org.apache.xmlgraphics/fop/2.4.0-SNAPSHOT/fop-2.4.0-SNAPSHOT.pom
> [JENKINS] Archiving
> <https://builds.apache.org/job/xmlgraphics-fop/ws/fop/target/fop-2.4.0
> -SNAPSHOT.jar> to
> org.apache.xmlgraphics/fop/2.4.0-SNAPSHOT/fop-2.4.0-SNAPSHOT.jar
> [JENKINS] Archiving
> <https://builds.apache.org/job/xmlgraphics-fop/ws/fop-servlet/pom.xml>
> to
> org.apache.xmlgraphics/fop-servlet/2.4.0-SNAPSHOT/fop-servlet-2.4.0-SN
> APSHOT.pom [JENKINS] Archiving
> <https://builds.apache.org/job/xmlgraphics-fop/ws/fop-servlet/target/f
> op-servlet-2.4.0-SNAPSHOT.war> to
> org.apache.xmlgraphics/fop-servlet/2.4.0-SNAPSHOT/fop-servlet-2.4.0-SN
> APSHOT.war [JENKINS] Archiving
> <https://builds.apache.org/job/xmlgraphics-fop/ws/fop-transcoder-allin
> one/pom.xml> to
> org.apache.xmlgraphics/fop-transcoder-allinone/2.4.0-SNAPSHOT/fop-tran
> scoder-allinone-2.4.0-SNAPSHOT.pom
> [JENKINS] Archiving
> <https://builds.apache.org/job/xmlgraphics-fop/ws/fop-transcoder-allin
> one/target/fop-transcoder-allinone-2.4.0-SNAPSHOT.jar> to
> org.apache.xmlgraphics/fop-transcoder-allinone/2.4.0-SNAPSHOT/fop-tran
> scoder-allinone-2.4.0-SNAPSHOT.jar
> [JENKINS] Archiving
> <https://builds.apache.org/job/xmlgraphics-fop/ws/fop-util/pom.xml> to
> org.apache.xmlgraphics/fop-util/2.4.0-SNAPSHOT/fop-util-2.4.0-SNAPSHOT
> .pom [JENKINS] Archiving
> <https://builds.apache.org/job/xmlgraphics-fop/ws/fop-util/target/fop-
> util-2.4.0-SNAPSHOT.jar> to
> org.apache.xmlgraphics/fop-util/2.4.0-SNAPSHOT/fop-util-2.4.0-SNAPSHOT
> .jar [JENKINS] Archiving
> <https://builds.apache.org/job/xmlgraphics-fop/ws/fop-events/pom.xml>
> to
> org.apache.xmlgraphics/fop-events/2.4.0-SNAPSHOT/fop-events-2.4.0-SNAP
> SHOT.pom [JENKINS] Archiving
> <https://builds.apache.org/job/xmlgraphics-fop/ws/fop-events/target/fo
> p-events-2.4.0-SNAPSHOT.jar> to
> org.apache.xmlgraphics/fop-events/2.4.0-SNAPSHOT/fop-events-2.4.0-SNAP
> SHOT.jar [JENKINS] Archiving
> <https://builds.apache.org/job/xmlgraphics-fop/ws/fop-transcoder/pom.x
> ml> to
> org.apache.xmlgraphics/fop-transcoder/2.4.0-SNAPSHOT/fop-transcoder-2.
> 4.0-SNAPSHOT.pom [JENKINS] Archiving
> <https://builds.apache.org/job/xmlgraphics-fop/ws/fop-transcoder/targe
> t/fop-transcoder-2.4.0-SNAPSHOT.jar> to
> org.apache.xmlgraphics/fop-transcoder/2.4.0-SNAPSHOT/fop-transcoder-2.
> 4.0-SNAPSHOT.jar [CHECKSTYLE] Plug-in Result: Success - no threshold
> has been exceeded [CHECKSTYLE] Plug-in Result: Success - no threshold
> has been exceeded [CHECKSTYLE] Plug-in Result: Success - no threshold
> has been exceeded [CHECKSTYLE] Plug-in Result: Success - no threshold
> has been exceeded [FINDBUGS] Plug-in Result: Success - no threshold
> has been exceeded [FINDBUGS] Plug-in Result: Success - no threshold
> has been exceeded [FINDBUGS] Plug-in Result: Success - no threshold
> has been exceeded [FINDBUGS] Plug-in Result: Success - no threshold
> has been exceeded channel stopped Maven RedeployPublisher use remote
> ubuntu-1 maven settings from : /home/jenkins/.m2/settings.xml [INFO]
> Deployment in
> https://repository.apache.org/content/repositories/snapshots 
> (id=apache.snapshots.https,uniqueVersion=true)
> Deploying the main artifact fop-2.4.0-SNAPSHOT.jar
> Downloading:
> https://repository.apache.org/content/repositories/snapshots/org/apach
> e/xmlgraphics/fop/2.4.0-SNAPSHOT/maven-metadata.xml
> Downloaded:
> https://repository.apache.org/content/repositories/snapshots/org/apach
> e/xmlgraphics/fop/2.4.0-SNAPSHOT/maven-metadata.xml (778 B at 0.9
> KB/sec)
> Uploading:
> https://repository.apache.org/content/repositories/snapshots/org/apach
> e/xmlgraphics/fop/2.4.0-SNAPSHOT/fop-2.4.0-20181010.204324-12.jar
> Uploading:
> https://repository.apache.org/content/repositories/snapshots/org/apach
> e/xmlgraphics/fop/2.4.0-SNAPSHOT/fop-2.4.0-20181010.204324-12.pom
> ERROR: Failed to deploy artifacts: Could not transfer artifact org.apache.xmlgraphics:fop:jar:2.4.0-20181010.204324-12 from/to apache.snapshots.https (https://repository.apache.org/content/repositories/snapshots): Failed to transfer file: https://repository.apache.org/content/repositories/snapshots/org/apache/xmlgraphics/fop/2.4.0-SNAPSHOT/fop-2.4.0-20181010.204324-12.jar. Return code is: 401, ReasonPhrase: Unauthorized.
> org.apache.maven.artifact.deployer.ArtifactDeploymentException: Failed to deploy artifacts: Could not transfer artifact org.apache.xmlgraphics:fop:jar:2.4.0-20181010.204324-12 from/to apache.snapshots.https (https://repository.apache.org/content/repositories/snapshots): Failed to transfer file: https://repository.apache.org/content/repositories/snapshots/org/apache/xmlgraphics/fop/2.4.0-SNAPSHOT/fop-2.4.0-20181010.204324-12.jar. Return code is: 401, ReasonPhrase: Unauthorized.
> at org.apache.maven.artifact.deployer.DefaultArtifactDeployer.deploy(DefaultArtifactDeployer.java:143)
> at hudson.maven.reporters.MavenArtifactRecord.deploy(MavenArtifactRecord.java:193)
> at hudson.maven.RedeployPublisher.perform(RedeployPublisher.java:176)
> at hudson.tasks.BuildStepMonitor$1.perform(BuildStepMonitor.java:20)
> at hudson.model.AbstractBuild$AbstractBuildExecution.perform(AbstractBuild.java:744)
> at hudson.model.AbstractBuild$AbstractBuildExecution.performAllBuildSteps(AbstractBuild.java:690)
> at hudson.maven.MavenModuleSetBuild$MavenModuleSetBuildExecution.post2(MavenModuleSetBuild.java:1073)
> at hudson.model.AbstractBuild$AbstractBuildExecution.post(AbstractBuild.java:635)
> at hudson.model.Run.execute(Run.java:1819)
> at hudson.maven.MavenModuleSetBuild.run(MavenModuleSetBuild.java:543)
> at hudson.model.ResourceController.execute(ResourceController.java:97)
> at hudson.model.Executor.run(Executor.java:429)
> Caused by: org.eclipse.aether.deployment.DeploymentException: Failed to deploy artifacts: Could not transfer artifact org.apache.xmlgraphics:fop:jar:2.4.0-20181010.204324-12 from/to apache.snapshots.https (https://repository.apache.org/content/repositories/snapshots): Failed to transfer file: https://repository.apache.org/content/repositories/snapshots/org/apache/xmlgraphics/fop/2.4.0-SNAPSHOT/fop-2.4.0-20181010.204324-12.jar. Return code is: 401, ReasonPhrase: Unauthorized.
> at org.eclipse.aether.internal.impl.DefaultDeployer.deploy(DefaultDeployer.java:317)
> at org.eclipse.aether.internal.impl.DefaultDeployer.deploy(DefaultDeployer.java:245)
> at org.eclipse.aether.internal.impl.DefaultRepositorySystem.deploy(DefaultRepositorySystem.java:420)
> at org.apache.maven.artifact.deployer.DefaultArtifactDeployer.deploy(DefaultArtifactDeployer.java:139)
> ... 11 more
> Caused by: org.eclipse.aether.transfer.ArtifactTransferException: Could not transfer artifact org.apache.xmlgraphics:fop:jar:2.4.0-20181010.204324-12 from/to apache.snapshots.https (https://repository.apache.org/content/repositories/snapshots): Failed to transfer file: https://repository.apache.org/content/repositories/snapshots/org/apache/xmlgraphics/fop/2.4.0-SNAPSHOT/fop-2.4.0-20181010.204324-12.jar. Return code is: 401, ReasonPhrase: Unauthorized.
> at org.eclipse.aether.connector.basic.ArtifactTransportListener.transferFailed(ArtifactTransportListener.java:43)
> at org.eclipse.aether.connector.basic.BasicRepositoryConnector$TaskRunner.run(BasicRepositoryConnector.java:355)
> at org.eclipse.aether.connector.basic.BasicRepositoryConnector.put(BasicRepositoryConnector.java:274)
> at org.eclipse.aether.internal.impl.DefaultDeployer.deploy(DefaultDeployer.java:311)
> ... 14 more
> Caused by: org.apache.maven.wagon.TransferFailedException: Failed to transfer file: https://repository.apache.org/content/repositories/snapshots/org/apache/xmlgraphics/fop/2.4.0-SNAPSHOT/fop-2.4.0-20181010.204324-12.jar. Return code is: 401, ReasonPhrase: Unauthorized.
> at org.apache.maven.wagon.shared.http.AbstractHttpClientWagon.put(AbstractHttpClientWagon.java:635)
> at org.apache.maven.wagon.shared.http.AbstractHttpClientWagon.put(AbstractHttpClientWagon.java:557)
> at org.apache.maven.wagon.shared.http.AbstractHttpClientWagon.put(AbstractHttpClientWagon.java:539)
> at org.apache.maven.wagon.shared.http.AbstractHttpClientWagon.put(AbstractHttpClientWagon.java:533)
> at org.apache.maven.wagon.shared.http.AbstractHttpClientWagon.put(AbstractHttpClientWagon.java:513)
> at org.eclipse.aether.transport.wagon.WagonTransporter$PutTaskRunner.run(WagonTransporter.java:644)
> at org.eclipse.aether.transport.wagon.WagonTransporter.execute(WagonTransporter.java:427)
> at org.eclipse.aether.transport.wagon.WagonTransporter.put(WagonTransporter.java:410)
> at org.eclipse.aether.connector.basic.BasicRepositoryConnector$PutTaskRunner.runTask(BasicRepositoryConnector.java:510)
> at org.eclipse.aether.connector.basic.BasicRepositoryConnector$TaskRunner.run(BasicRepositoryConnector.java:350)
> ... 16 more
> [INFO] Deployment failed after 3.9 sec Build step 'Deploy artifacts to
> Maven repository' changed build result to FAILURE


Reply | Threaded
Open this post in threaded view
|

Jenkins build is back to normal : xmlgraphics-fop #220

Apache Jenkins Server
In reply to this post by Apache Jenkins Server