Build failed in Jenkins: xmlgraphics-fop #118

Previous Topic Next Topic
 
classic Classic list List threaded Threaded
3 messages Options
Reply | Threaded
Open this post in threaded view
|

Build failed in Jenkins: xmlgraphics-fop #118

Apache Jenkins Server
See <https://builds.apache.org/job/xmlgraphics-fop/118/display/redirect?page=changes>

Changes:

[ssteiner] Bump version

------------------------------------------
Started by an SCM change
[EnvInject] - Loading node environment variables.
Building remotely on ubuntu-1 (ubuntu) in workspace <https://builds.apache.org/job/xmlgraphics-fop/ws/>
Updating https://svn.apache.org/repos/asf/xmlgraphics/fop/trunk at revision '2017-03-27T10:08:12.721 +0000'
U         fop/pom.xml
U         fop/build.xml
U         fop-transcoder-allinone/pom.xml
U         fop-events/pom.xml
U         fop-servlet/pom.xml
U         fop-transcoder/pom.xml
U         fop-core/pom.xml
U         pom.xml
U         fop-util/pom.xml
U         fop-sandbox/pom.xml
At revision 1788876

Parsing POMs
Modules changed, recalculating dependency graph
Established TCP socket on 57523
maven3-agent.jar already up to date
maven3-interceptor.jar already up to date
maven3-interceptor-commons.jar already up to date
[xmlgraphics-fop] $ /home/jenkins/tools/java/jdk1.7.0_79-unlimited-security/bin/java -Xmx2g -Xms256m -cp /home/jenkins/jenkins-slave/maven3-agent.jar:/home/jenkins/tools/maven/apache-maven-3.0.4/boot/plexus-classworlds-2.4.jar org.jvnet.hudson.maven3.agent.Maven3Main /home/jenkins/tools/maven/apache-maven-3.0.4 /home/jenkins/jenkins-slave/slave.jar /home/jenkins/jenkins-slave/maven3-interceptor.jar /home/jenkins/jenkins-slave/maven3-interceptor-commons.jar 57523
<===[JENKINS REMOTING CAPACITY]===>   channel started
Executing Maven:  -B -f <https://builds.apache.org/job/xmlgraphics-fop/ws/pom.xml> -Dmaven.repo.local=/home/jenkins/jenkins-slave/maven-repositories/1 clean install checkstyle:checkstyle findbugs:findbugs -B -U -e -fae -V -Djdk.path=/home/jenkins/tools/java/jdk1.6.0_20-32-unlimited-security
Apache Maven 3.0.4 (r1232337; 2012-01-17 08:44:56+0000)
Maven home: /usr/local/asfpackages/maven/apache-maven-3.0.4
Java version: 1.7.0_79, vendor: Oracle Corporation
Java home: /usr/local/asfpackages/java/jdk1.7.0_79-unlimited-security/jre
Default locale: en_US, platform encoding: ISO-8859-1
OS name: "linux", version: "3.13.0-109-generic", arch: "amd64", family: "unix"
[INFO] Error stacktraces are turned on.
[INFO] Scanning for projects...
[INFO] ------------------------------------------------------------------------
[INFO] Reactor Build Order:
[INFO]
[INFO] Apache FOP Parent
[INFO] Apache FOP Utilities
[INFO] Apache FOP Events
[INFO] Apache FOP Core
[INFO] Apache FOP All-In-One
[INFO] Apache FOP Sandbox
[INFO] Apache FOP Servlet
[INFO] Apache FOP Transcoder
[INFO] Apache FOP Transcoder All-In-One
Downloading: http://repo.maven.apache.org/maven2/org/apache/maven/plugins/maven-metadata.xml
Downloading: http://repo.maven.apache.org/maven2/org/codehaus/mojo/maven-metadata.xml
Downloaded: http://repo.maven.apache.org/maven2/org/codehaus/mojo/maven-metadata.xml (20 KB at 135.1 KB/sec)
Downloaded: http://repo.maven.apache.org/maven2/org/apache/maven/plugins/maven-metadata.xml (13 KB at 86.7 KB/sec)
Downloading: http://repo.maven.apache.org/maven2/org/codehaus/mojo/findbugs-maven-plugin/maven-metadata.xml
Downloaded: http://repo.maven.apache.org/maven2/org/codehaus/mojo/findbugs-maven-plugin/maven-metadata.xml (2 KB at 58.6 KB/sec)
[INFO]                                                                        
[INFO] ------------------------------------------------------------------------
[INFO] Building Apache FOP Parent 2.3.0-SNAPSHOT
[INFO] ------------------------------------------------------------------------
[INFO]
[INFO] --- maven-clean-plugin:2.4.1:clean (default-clean) @ fop-parent ---
[INFO] Deleting <https://builds.apache.org/job/xmlgraphics-fop/ws/target>
[INFO]
[INFO] --- maven-install-plugin:2.3.1:install (default-install) @ fop-parent ---
[INFO] Installing <https://builds.apache.org/job/xmlgraphics-fop/ws/pom.xml> to /home/jenkins/jenkins-slave/maven-repositories/1/org/apache/xmlgraphics/fop-parent/2.3.0-SNAPSHOT/fop-parent-2.3.0-SNAPSHOT.pom
[INFO]
[INFO] --- maven-checkstyle-plugin:2.14:checkstyle (default-cli) @ fop-parent ---
[CHECKSTYLE] No report found for mojo checkstyle[INFO]
[INFO] --- findbugs-maven-plugin:3.0.4:findbugs (default-cli) @ fop-parent ---

[FINDBUGS] No report found for mojo findbugs
[INFO]                                                                        
[INFO] ------------------------------------------------------------------------
[INFO] Building Apache FOP Utilities 2.3.0-SNAPSHOT
[INFO] ------------------------------------------------------------------------
Downloading: https://repository.apache.org/content/repositories/snapshots/org/apache/xmlgraphics/xmlgraphics-commons/2.3.0-SNAPSHOT/maven-metadata.xml
Downloading: https://repository.jboss.org/nexus/content/repositories/thirdparty-releases/org/apache/xmlgraphics/xmlgraphics-commons/2.3.0-SNAPSHOT/maven-metadata.xml
Downloading: https://repository.apache.org/content/repositories/snapshots/org/apache/xmlgraphics/xmlgraphics-commons/2.3.0-SNAPSHOT/xmlgraphics-commons-2.3.0-SNAPSHOT.pom
Downloading: https://repository.jboss.org/nexus/content/repositories/thirdparty-releases/org/apache/xmlgraphics/xmlgraphics-commons/2.3.0-SNAPSHOT/xmlgraphics-commons-2.3.0-SNAPSHOT.pom
[WARNING] The POM for org.apache.xmlgraphics:xmlgraphics-commons:jar:2.3.0-SNAPSHOT is missing, no dependency information available
Downloading: https://repository.apache.org/content/repositories/snapshots/org/apache/xmlgraphics/xmlgraphics-commons/2.3.0-SNAPSHOT/xmlgraphics-commons-2.3.0-SNAPSHOT.jar
Downloading: https://repository.jboss.org/nexus/content/repositories/thirdparty-releases/org/apache/xmlgraphics/xmlgraphics-commons/2.3.0-SNAPSHOT/xmlgraphics-commons-2.3.0-SNAPSHOT.jar
[INFO]                                                                        
[INFO] ------------------------------------------------------------------------
[INFO] Skipping Apache FOP Events
[INFO] This project has been banned from the build due to previous failures.
[INFO] ------------------------------------------------------------------------
[INFO]                                                                        
[INFO] ------------------------------------------------------------------------
[INFO] Skipping Apache FOP Core
[INFO] This project has been banned from the build due to previous failures.
[INFO] ------------------------------------------------------------------------
[INFO]                                                                        
[INFO] ------------------------------------------------------------------------
[INFO] Skipping Apache FOP All-In-One
[INFO] This project has been banned from the build due to previous failures.
[INFO] ------------------------------------------------------------------------
[INFO]                                                                        
[INFO] ------------------------------------------------------------------------
[INFO] Skipping Apache FOP Sandbox
[INFO] This project has been banned from the build due to previous failures.
[INFO] ------------------------------------------------------------------------
[INFO]                                                                        
[INFO] ------------------------------------------------------------------------
[INFO] Skipping Apache FOP Servlet
[INFO] This project has been banned from the build due to previous failures.
[INFO] ------------------------------------------------------------------------
[INFO]                                                                        
[INFO] ------------------------------------------------------------------------
[INFO] Skipping Apache FOP Transcoder
[INFO] This project has been banned from the build due to previous failures.
[INFO] ------------------------------------------------------------------------
[INFO]                                                                        
[INFO] ------------------------------------------------------------------------
[INFO] Skipping Apache FOP Transcoder All-In-One
[INFO] This project has been banned from the build due to previous failures.
[INFO] ------------------------------------------------------------------------
[INFO] ------------------------------------------------------------------------
[INFO] Reactor Summary:
[INFO]
[INFO] Apache FOP Parent ................................. SUCCESS [5.567s]
[INFO] Apache FOP Utilities .............................. FAILURE [1.854s]
[INFO] Apache FOP Events ................................. SKIPPED
[INFO] Apache FOP Core ................................... SKIPPED
[INFO] Apache FOP All-In-One ............................. SKIPPED
[INFO] Apache FOP Sandbox ................................ SKIPPED
[INFO] Apache FOP Servlet ................................ SKIPPED
[INFO] Apache FOP Transcoder ............................. SKIPPED
[INFO] Apache FOP Transcoder All-In-One .................. SKIPPED
[INFO] ------------------------------------------------------------------------
[INFO] BUILD FAILURE
[INFO] ------------------------------------------------------------------------
[INFO] Total time: 10.487s
[INFO] Finished at: Mon Mar 27 10:09:24 UTC 2017
[INFO] Final Memory: 29M/255M
[INFO] ------------------------------------------------------------------------
Waiting for Jenkins to finish collecting data[ERROR] Failed to execute goal on project fop-util: Could not resolve dependencies for project org.apache.xmlgraphics:fop-util:jar:2.3.0-SNAPSHOT: Could not find artifact org.apache.xmlgraphics:xmlgraphics-commons:jar:2.3.0-SNAPSHOT in apache.snapshots.https (https://repository.apache.org/content/repositories/snapshots) -> [Help 1]
org.apache.maven.lifecycle.LifecycleExecutionException: Failed to execute goal on project fop-util: Could not resolve dependencies for project org.apache.xmlgraphics:fop-util:jar:2.3.0-SNAPSHOT: Could not find artifact org.apache.xmlgraphics:xmlgraphics-commons:jar:2.3.0-SNAPSHOT in apache.snapshots.https (https://repository.apache.org/content/repositories/snapshots)
        at org.apache.maven.lifecycle.internal.LifecycleDependencyResolver.getDependencies(LifecycleDependencyResolver.java:210)
        at org.apache.maven.lifecycle.internal.LifecycleDependencyResolver.resolveProjectDependencies(LifecycleDependencyResolver.java:117)
        at org.apache.maven.lifecycle.internal.MojoExecutor.ensureDependenciesAreResolved(MojoExecutor.java:258)
        at org.apache.maven.lifecycle.internal.MojoExecutor.execute(MojoExecutor.java:201)
        at org.apache.maven.lifecycle.internal.MojoExecutor.execute(MojoExecutor.java:153)
        at org.apache.maven.lifecycle.internal.MojoExecutor.execute(MojoExecutor.java:145)
        at org.apache.maven.lifecycle.internal.LifecycleModuleBuilder.buildProject(LifecycleModuleBuilder.java:84)
        at org.apache.maven.lifecycle.internal.LifecycleModuleBuilder.buildProject(LifecycleModuleBuilder.java:59)
        at org.apache.maven.lifecycle.internal.LifecycleStarter.singleThreadedBuild(LifecycleStarter.java:183)
        at org.apache.maven.lifecycle.internal.LifecycleStarter.execute(LifecycleStarter.java:161)
        at org.apache.maven.DefaultMaven.doExecute(DefaultMaven.java:320)
        at org.apache.maven.DefaultMaven.execute(DefaultMaven.java:156)
        at org.jvnet.hudson.maven3.launcher.Maven3Launcher.main(Maven3Launcher.java:117)
        at sun.reflect.NativeMethodAccessorImpl.invoke0(Native Method)
        at sun.reflect.NativeMethodAccessorImpl.invoke(NativeMethodAccessorImpl.java:57)
        at sun.reflect.DelegatingMethodAccessorImpl.invoke(DelegatingMethodAccessorImpl.java:43)
        at java.lang.reflect.Method.invoke(Method.java:606)
        at org.codehaus.plexus.classworlds.launcher.Launcher.launchStandard(Launcher.java:329)
        at org.codehaus.plexus.classworlds.launcher.Launcher.launch(Launcher.java:239)
        at org.jvnet.hudson.maven3.agent.Maven3Main.launch(Maven3Main.java:181)
        at sun.reflect.NativeMethodAccessorImpl.invoke0(Native Method)
        at sun.reflect.NativeMethodAccessorImpl.invoke(NativeMethodAccessorImpl.java:57)
        at sun.reflect.DelegatingMethodAccessorImpl.invoke(DelegatingMethodAccessorImpl.java:43)
        at java.lang.reflect.Method.invoke(Method.java:606)
        at hudson.maven.Maven3Builder.call(Maven3Builder.java:139)
        at hudson.maven.Maven3Builder.call(Maven3Builder.java:70)
        at hudson.remoting.UserRequest.perform(UserRequest.java:153)
        at hudson.remoting.UserRequest.perform(UserRequest.java:50)
        at hudson.remoting.Request$2.run(Request.java:336)
        at hudson.remoting.InterceptingExecutorService$1.call(InterceptingExecutorService.java:68)
        at java.util.concurrent.FutureTask.run(FutureTask.java:262)
        at java.util.concurrent.ThreadPoolExecutor.runWorker(ThreadPoolExecutor.java:1145)
        at java.util.concurrent.ThreadPoolExecutor$Worker.run(ThreadPoolExecutor.java:615)
        at java.lang.Thread.run(Thread.java:745)
Caused by: org.apache.maven.project.DependencyResolutionException: Could not resolve dependencies for project org.apache.xmlgraphics:fop-util:jar:2.3.0-SNAPSHOT: Could not find artifact org.apache.xmlgraphics:xmlgraphics-commons:jar:2.3.0-SNAPSHOT in apache.snapshots.https (https://repository.apache.org/content/repositories/snapshots)
        at org.apache.maven.project.DefaultProjectDependenciesResolver.resolve(DefaultProjectDependenciesResolver.java:189)
        at org.apache.maven.lifecycle.internal.LifecycleDependencyResolver.getDependencies(LifecycleDependencyResolver.java:185)
        ... 33 more
Caused by: org.sonatype.aether.resolution.DependencyResolutionException: Could not find artifact org.apache.xmlgraphics:xmlgraphics-commons:jar:2.3.0-SNAPSHOT in apache.snapshots.https (https://repository.apache.org/content/repositories/snapshots)
        at org.sonatype.aether.impl.internal.DefaultRepositorySystem.resolveDependencies(DefaultRepositorySystem.java:375)
        at org.apache.maven.project.DefaultProjectDependenciesResolver.resolve(DefaultProjectDependenciesResolver.java:183)
        ... 34 more
Caused by: org.sonatype.aether.resolution.ArtifactResolutionException: Could not find artifact org.apache.xmlgraphics:xmlgraphics-commons:jar:2.3.0-SNAPSHOT in apache.snapshots.https (https://repository.apache.org/content/repositories/snapshots)
        at org.sonatype.aether.impl.internal.DefaultArtifactResolver.resolve(DefaultArtifactResolver.java:538)
        at org.sonatype.aether.impl.internal.DefaultArtifactResolver.resolveArtifacts(DefaultArtifactResolver.java:216)
        at org.sonatype.aether.impl.internal.DefaultRepositorySystem.resolveDependencies(DefaultRepositorySystem.java:358)
        ... 35 more
Caused by: org.sonatype.aether.transfer.ArtifactNotFoundException: Could not find artifact org.apache.xmlgraphics:xmlgraphics-commons:jar:2.3.0-SNAPSHOT in apache.snapshots.https (https://repository.apache.org/content/repositories/snapshots)
        at org.sonatype.aether.connector.wagon.WagonRepositoryConnector$4.wrap(WagonRepositoryConnector.java:947)
        at org.sonatype.aether.connector.wagon.WagonRepositoryConnector$4.wrap(WagonRepositoryConnector.java:941)
        at org.sonatype.aether.connector.wagon.WagonRepositoryConnector$GetTask.run(WagonRepositoryConnector.java:669)
        at org.sonatype.aether.util.concurrency.RunnableErrorForwarder$1.run(RunnableErrorForwarder.java:60)
        ... 3 more
[ERROR]
[ERROR] Re-run Maven using the -X switch to enable full debug logging.
[ERROR]
[ERROR] For more information about the errors and possible solutions, please read the following articles:
[ERROR] [Help 1] http://cwiki.apache.org/confluence/display/MAVEN/DependencyResolutionException
[ERROR]
[ERROR] After correcting the problems, you can resume the build with the command
[ERROR]   mvn <goals> -rf :fop-util

[JENKINS] Archiving <https://builds.apache.org/job/xmlgraphics-fop/ws/fop-sandbox/pom.xml> to org.apache.xmlgraphics/fop-sandbox/2.3.0-SNAPSHOT/fop-sandbox-2.3.0-SNAPSHOT.pom
[JENKINS] Archiving <https://builds.apache.org/job/xmlgraphics-fop/ws/pom.xml> to org.apache.xmlgraphics/fop-parent/2.3.0-SNAPSHOT/fop-parent-2.3.0-SNAPSHOT.pom
[JENKINS] Archiving <https://builds.apache.org/job/xmlgraphics-fop/ws/fop-core/pom.xml> to org.apache.xmlgraphics/fop-core/2.3.0-SNAPSHOT/fop-core-2.3.0-SNAPSHOT.pom
[JENKINS] Archiving <https://builds.apache.org/job/xmlgraphics-fop/ws/fop/pom.xml> to org.apache.xmlgraphics/fop/2.3.0-SNAPSHOT/fop-2.3.0-SNAPSHOT.pom
[JENKINS] Archiving <https://builds.apache.org/job/xmlgraphics-fop/ws/fop-servlet/pom.xml> to org.apache.xmlgraphics/fop-servlet/2.3.0-SNAPSHOT/fop-servlet-2.3.0-SNAPSHOT.pom
[JENKINS] Archiving <https://builds.apache.org/job/xmlgraphics-fop/ws/fop-transcoder-allinone/pom.xml> to org.apache.xmlgraphics/fop-transcoder-allinone/2.3.0-SNAPSHOT/fop-transcoder-allinone-2.3.0-SNAPSHOT.pom
[JENKINS] Archiving <https://builds.apache.org/job/xmlgraphics-fop/ws/fop-util/pom.xml> to org.apache.xmlgraphics/fop-util/2.3.0-SNAPSHOT/fop-util-2.3.0-SNAPSHOT.pom
[JENKINS] Archiving <https://builds.apache.org/job/xmlgraphics-fop/ws/fop-events/pom.xml> to org.apache.xmlgraphics/fop-events/2.3.0-SNAPSHOT/fop-events-2.3.0-SNAPSHOT.pom
[JENKINS] Archiving <https://builds.apache.org/job/xmlgraphics-fop/ws/fop-transcoder/pom.xml> to org.apache.xmlgraphics/fop-transcoder/2.3.0-SNAPSHOT/fop-transcoder-2.3.0-SNAPSHOT.pom
channel stopped
Reply | Threaded
Open this post in threaded view
|

Build failed in Jenkins: xmlgraphics-fop #119

Apache Jenkins Server
See <https://builds.apache.org/job/xmlgraphics-fop/119/display/redirect>

------------------------------------------
Started by upstream project "xmlgraphics-batik-maven" build number 43
originally caused by:
 Started by an SCM change
[EnvInject] - Loading node environment variables.
Building remotely on ubuntu-1 (ubuntu) in workspace <https://builds.apache.org/job/xmlgraphics-fop/ws/>
Updating https://svn.apache.org/repos/asf/xmlgraphics/fop/trunk at revision '2017-03-27T10:09:37.791 +0000'
At revision 1788877

No changes for https://svn.apache.org/repos/asf/xmlgraphics/fop/trunk since the previous build
Parsing POMs
Established TCP socket on 54422
maven3-agent.jar already up to date
maven3-interceptor.jar already up to date
maven3-interceptor-commons.jar already up to date
[xmlgraphics-fop] $ /home/jenkins/tools/java/jdk1.7.0_79-unlimited-security/bin/java -Xmx2g -Xms256m -cp /home/jenkins/jenkins-slave/maven3-agent.jar:/home/jenkins/tools/maven/apache-maven-3.0.4/boot/plexus-classworlds-2.4.jar org.jvnet.hudson.maven3.agent.Maven3Main /home/jenkins/tools/maven/apache-maven-3.0.4 /home/jenkins/jenkins-slave/slave.jar /home/jenkins/jenkins-slave/maven3-interceptor.jar /home/jenkins/jenkins-slave/maven3-interceptor-commons.jar 54422
<===[JENKINS REMOTING CAPACITY]===>   channel started
Executing Maven:  -B -f <https://builds.apache.org/job/xmlgraphics-fop/ws/pom.xml> -Dmaven.repo.local=/home/jenkins/jenkins-slave/maven-repositories/1 clean install checkstyle:checkstyle findbugs:findbugs -B -U -e -fae -V -Djdk.path=/home/jenkins/tools/java/jdk1.6.0_20-32-unlimited-security
Apache Maven 3.0.4 (r1232337; 2012-01-17 08:44:56+0000)
Maven home: /usr/local/asfpackages/maven/apache-maven-3.0.4
Java version: 1.7.0_79, vendor: Oracle Corporation
Java home: /usr/local/asfpackages/java/jdk1.7.0_79-unlimited-security/jre
Default locale: en_US, platform encoding: ISO-8859-1
OS name: "linux", version: "3.13.0-109-generic", arch: "amd64", family: "unix"
[INFO] Error stacktraces are turned on.
[INFO] Scanning for projects...
[INFO] ------------------------------------------------------------------------
[INFO] Reactor Build Order:
[INFO]
[INFO] Apache FOP Parent
[INFO] Apache FOP Utilities
[INFO] Apache FOP Events
[INFO] Apache FOP Core
[INFO] Apache FOP All-In-One
[INFO] Apache FOP Sandbox
[INFO] Apache FOP Servlet
[INFO] Apache FOP Transcoder
[INFO] Apache FOP Transcoder All-In-One
Downloading: http://repo.maven.apache.org/maven2/org/codehaus/mojo/maven-metadata.xml
Downloading: http://repo.maven.apache.org/maven2/org/apache/maven/plugins/maven-metadata.xml
Downloaded: http://repo.maven.apache.org/maven2/org/apache/maven/plugins/maven-metadata.xml (13 KB at 89.1 KB/sec)
Downloaded: http://repo.maven.apache.org/maven2/org/codehaus/mojo/maven-metadata.xml (20 KB at 138.8 KB/sec)
Downloading: http://repo.maven.apache.org/maven2/org/codehaus/mojo/findbugs-maven-plugin/maven-metadata.xml
Downloaded: http://repo.maven.apache.org/maven2/org/codehaus/mojo/findbugs-maven-plugin/maven-metadata.xml (2 KB at 58.6 KB/sec)
[INFO]                                                                        
[INFO] ------------------------------------------------------------------------
[INFO] Building Apache FOP Parent 2.3.0-SNAPSHOT
[INFO] ------------------------------------------------------------------------
[INFO]
[INFO] --- maven-clean-plugin:2.4.1:clean (default-clean) @ fop-parent ---
[INFO] Deleting <https://builds.apache.org/job/xmlgraphics-fop/ws/target>
[INFO]
[INFO] --- maven-install-plugin:2.3.1:install (default-install) @ fop-parent ---
[INFO] Installing <https://builds.apache.org/job/xmlgraphics-fop/ws/pom.xml> to /home/jenkins/jenkins-slave/maven-repositories/1/org/apache/xmlgraphics/fop-parent/2.3.0-SNAPSHOT/fop-parent-2.3.0-SNAPSHOT.pom
[INFO]
[INFO] --- maven-checkstyle-plugin:2.14:checkstyle (default-cli) @ fop-parent ---
[CHECKSTYLE] No report found for mojo checkstyle[INFO]
[INFO] --- findbugs-maven-plugin:3.0.4:findbugs (default-cli) @ fop-parent ---

[FINDBUGS] No report found for mojo findbugs
[INFO]                                                                        
[INFO] ------------------------------------------------------------------------
[INFO] Building Apache FOP Utilities 2.3.0-SNAPSHOT
[INFO] ------------------------------------------------------------------------
Downloading: https://repository.jboss.org/nexus/content/repositories/thirdparty-releases/org/apache/xmlgraphics/xmlgraphics-commons/2.3.0-SNAPSHOT/maven-metadata.xml
Downloading: https://repository.apache.org/content/repositories/snapshots/org/apache/xmlgraphics/xmlgraphics-commons/2.3.0-SNAPSHOT/maven-metadata.xml
Downloading: https://repository.apache.org/content/repositories/snapshots/org/apache/xmlgraphics/xmlgraphics-commons/2.3.0-SNAPSHOT/xmlgraphics-commons-2.3.0-SNAPSHOT.pom
Downloading: https://repository.jboss.org/nexus/content/repositories/thirdparty-releases/org/apache/xmlgraphics/xmlgraphics-commons/2.3.0-SNAPSHOT/xmlgraphics-commons-2.3.0-SNAPSHOT.pom
[WARNING] The POM for org.apache.xmlgraphics:xmlgraphics-commons:jar:2.3.0-SNAPSHOT is missing, no dependency information available
Downloading: https://repository.apache.org/content/repositories/snapshots/org/apache/xmlgraphics/xmlgraphics-commons/2.3.0-SNAPSHOT/xmlgraphics-commons-2.3.0-SNAPSHOT.jar
Downloading: https://repository.jboss.org/nexus/content/repositories/thirdparty-releases/org/apache/xmlgraphics/xmlgraphics-commons/2.3.0-SNAPSHOT/xmlgraphics-commons-2.3.0-SNAPSHOT.jar
[INFO]                                                                        
[INFO] ------------------------------------------------------------------------
[INFO] Skipping Apache FOP Events
[INFO] This project has been banned from the build due to previous failures.
[INFO] ------------------------------------------------------------------------
[INFO]                                                                        
[INFO] ------------------------------------------------------------------------
[INFO] Skipping Apache FOP Core
[INFO] This project has been banned from the build due to previous failures.
[INFO] ------------------------------------------------------------------------
[INFO]                                                                        
[INFO] ------------------------------------------------------------------------
[INFO] Skipping Apache FOP All-In-One
[INFO] This project has been banned from the build due to previous failures.
[INFO] ------------------------------------------------------------------------
[INFO]                                                                        
[INFO] ------------------------------------------------------------------------
[INFO] Skipping Apache FOP Sandbox
[INFO] This project has been banned from the build due to previous failures.
[INFO] ------------------------------------------------------------------------
[INFO]                                                                        
[INFO] ------------------------------------------------------------------------
[INFO] Skipping Apache FOP Servlet
[INFO] This project has been banned from the build due to previous failures.
[INFO] ------------------------------------------------------------------------
[INFO]                                                                        
[INFO] ------------------------------------------------------------------------
[INFO] Skipping Apache FOP Transcoder
[INFO] This project has been banned from the build due to previous failures.
[INFO] ------------------------------------------------------------------------
[INFO]                                                                        
[INFO] ------------------------------------------------------------------------
[INFO] Skipping Apache FOP Transcoder All-In-One
[INFO] This project has been banned from the build due to previous failures.
[INFO] ------------------------------------------------------------------------
[INFO] ------------------------------------------------------------------------
[INFO] Reactor Summary:
[INFO]
[INFO] Apache FOP Parent ................................. SUCCESS [4.680s]
[INFO] Apache FOP Utilities .............................. FAILURE [8.117s]
[INFO] Apache FOP Events ................................. SKIPPED
[INFO] Apache FOP Core ................................... SKIPPED
[INFO] Apache FOP All-In-One ............................. SKIPPED
[INFO] Apache FOP Sandbox ................................ SKIPPED
[INFO] Apache FOP Servlet ................................ SKIPPED
[INFO] Apache FOP Transcoder ............................. SKIPPED
[INFO] Apache FOP Transcoder All-In-One .................. SKIPPED
[INFO] ------------------------------------------------------------------------
[INFO] BUILD FAILURE
[INFO] ------------------------------------------------------------------------
[INFO] Total time: 16.245s
[INFO] Finished at: Mon Mar 27 10:10:08 UTC 2017
[INFO] Final Memory: 30M/310M
[INFO] ------------------------------------------------------------------------
Waiting for Jenkins to finish collecting data[ERROR] Failed to execute goal on project fop-util: Could not resolve dependencies for project org.apache.xmlgraphics:fop-util:jar:2.3.0-SNAPSHOT: Could not find artifact org.apache.xmlgraphics:xmlgraphics-commons:jar:2.3.0-SNAPSHOT in apache.snapshots.https (https://repository.apache.org/content/repositories/snapshots) -> [Help 1]
org.apache.maven.lifecycle.LifecycleExecutionException: Failed to execute goal on project fop-util: Could not resolve dependencies for project org.apache.xmlgraphics:fop-util:jar:2.3.0-SNAPSHOT: Could not find artifact org.apache.xmlgraphics:xmlgraphics-commons:jar:2.3.0-SNAPSHOT in apache.snapshots.https (https://repository.apache.org/content/repositories/snapshots)
        at org.apache.maven.lifecycle.internal.LifecycleDependencyResolver.getDependencies(LifecycleDependencyResolver.java:210)
        at org.apache.maven.lifecycle.internal.LifecycleDependencyResolver.resolveProjectDependencies(LifecycleDependencyResolver.java:117)
        at org.apache.maven.lifecycle.internal.MojoExecutor.ensureDependenciesAreResolved(MojoExecutor.java:258)
        at org.apache.maven.lifecycle.internal.MojoExecutor.execute(MojoExecutor.java:201)
        at org.apache.maven.lifecycle.internal.MojoExecutor.execute(MojoExecutor.java:153)
        at org.apache.maven.lifecycle.internal.MojoExecutor.execute(MojoExecutor.java:145)
        at org.apache.maven.lifecycle.internal.LifecycleModuleBuilder.buildProject(LifecycleModuleBuilder.java:84)
        at org.apache.maven.lifecycle.internal.LifecycleModuleBuilder.buildProject(LifecycleModuleBuilder.java:59)
        at org.apache.maven.lifecycle.internal.LifecycleStarter.singleThreadedBuild(LifecycleStarter.java:183)
        at org.apache.maven.lifecycle.internal.LifecycleStarter.execute(LifecycleStarter.java:161)
        at org.apache.maven.DefaultMaven.doExecute(DefaultMaven.java:320)
        at org.apache.maven.DefaultMaven.execute(DefaultMaven.java:156)
        at org.jvnet.hudson.maven3.launcher.Maven3Launcher.main(Maven3Launcher.java:117)
        at sun.reflect.NativeMethodAccessorImpl.invoke0(Native Method)
        at sun.reflect.NativeMethodAccessorImpl.invoke(NativeMethodAccessorImpl.java:57)
        at sun.reflect.DelegatingMethodAccessorImpl.invoke(DelegatingMethodAccessorImpl.java:43)
        at java.lang.reflect.Method.invoke(Method.java:606)
        at org.codehaus.plexus.classworlds.launcher.Launcher.launchStandard(Launcher.java:329)
        at org.codehaus.plexus.classworlds.launcher.Launcher.launch(Launcher.java:239)
        at org.jvnet.hudson.maven3.agent.Maven3Main.launch(Maven3Main.java:181)
        at sun.reflect.NativeMethodAccessorImpl.invoke0(Native Method)
        at sun.reflect.NativeMethodAccessorImpl.invoke(NativeMethodAccessorImpl.java:57)
        at sun.reflect.DelegatingMethodAccessorImpl.invoke(DelegatingMethodAccessorImpl.java:43)
        at java.lang.reflect.Method.invoke(Method.java:606)
        at hudson.maven.Maven3Builder.call(Maven3Builder.java:139)
        at hudson.maven.Maven3Builder.call(Maven3Builder.java:70)
        at hudson.remoting.UserRequest.perform(UserRequest.java:153)
        at hudson.remoting.UserRequest.perform(UserRequest.java:50)
        at hudson.remoting.Request$2.run(Request.java:336)
        at hudson.remoting.InterceptingExecutorService$1.call(InterceptingExecutorService.java:68)
        at java.util.concurrent.FutureTask.run(FutureTask.java:262)
        at java.util.concurrent.ThreadPoolExecutor.runWorker(ThreadPoolExecutor.java:1145)
        at java.util.concurrent.ThreadPoolExecutor$Worker.run(ThreadPoolExecutor.java:615)
        at java.lang.Thread.run(Thread.java:745)
Caused by: org.apache.maven.project.DependencyResolutionException: Could not resolve dependencies for project org.apache.xmlgraphics:fop-util:jar:2.3.0-SNAPSHOT: Could not find artifact org.apache.xmlgraphics:xmlgraphics-commons:jar:2.3.0-SNAPSHOT in apache.snapshots.https (https://repository.apache.org/content/repositories/snapshots)
        at org.apache.maven.project.DefaultProjectDependenciesResolver.resolve(DefaultProjectDependenciesResolver.java:189)
        at org.apache.maven.lifecycle.internal.LifecycleDependencyResolver.getDependencies(LifecycleDependencyResolver.java:185)
        ... 33 more
Caused by: org.sonatype.aether.resolution.DependencyResolutionException: Could not find artifact org.apache.xmlgraphics:xmlgraphics-commons:jar:2.3.0-SNAPSHOT in apache.snapshots.https (https://repository.apache.org/content/repositories/snapshots)
        at org.sonatype.aether.impl.internal.DefaultRepositorySystem.resolveDependencies(DefaultRepositorySystem.java:375)
        at org.apache.maven.project.DefaultProjectDependenciesResolver.resolve(DefaultProjectDependenciesResolver.java:183)
        ... 34 more
Caused by: org.sonatype.aether.resolution.ArtifactResolutionException: Could not find artifact org.apache.xmlgraphics:xmlgraphics-commons:jar:2.3.0-SNAPSHOT in apache.snapshots.https (https://repository.apache.org/content/repositories/snapshots)
        at org.sonatype.aether.impl.internal.DefaultArtifactResolver.resolve(DefaultArtifactResolver.java:538)
        at org.sonatype.aether.impl.internal.DefaultArtifactResolver.resolveArtifacts(DefaultArtifactResolver.java:216)
        at org.sonatype.aether.impl.internal.DefaultRepositorySystem.resolveDependencies(DefaultRepositorySystem.java:358)
        ... 35 more
Caused by: org.sonatype.aether.transfer.ArtifactNotFoundException: Could not find artifact org.apache.xmlgraphics:xmlgraphics-commons:jar:2.3.0-SNAPSHOT in apache.snapshots.https (https://repository.apache.org/content/repositories/snapshots)
        at org.sonatype.aether.connector.wagon.WagonRepositoryConnector$4.wrap(WagonRepositoryConnector.java:947)
        at org.sonatype.aether.connector.wagon.WagonRepositoryConnector$4.wrap(WagonRepositoryConnector.java:941)
        at org.sonatype.aether.connector.wagon.WagonRepositoryConnector$GetTask.run(WagonRepositoryConnector.java:669)
        at org.sonatype.aether.util.concurrency.RunnableErrorForwarder$1.run(RunnableErrorForwarder.java:60)
        ... 3 more
[ERROR]
[ERROR] Re-run Maven using the -X switch to enable full debug logging.
[ERROR]
[ERROR] For more information about the errors and possible solutions, please read the following articles:
[ERROR] [Help 1] http://cwiki.apache.org/confluence/display/MAVEN/DependencyResolutionException
[ERROR]
[ERROR] After correcting the problems, you can resume the build with the command
[ERROR]   mvn <goals> -rf :fop-util

[JENKINS] Archiving <https://builds.apache.org/job/xmlgraphics-fop/ws/fop-sandbox/pom.xml> to org.apache.xmlgraphics/fop-sandbox/2.3.0-SNAPSHOT/fop-sandbox-2.3.0-SNAPSHOT.pom
[JENKINS] Archiving <https://builds.apache.org/job/xmlgraphics-fop/ws/pom.xml> to org.apache.xmlgraphics/fop-parent/2.3.0-SNAPSHOT/fop-parent-2.3.0-SNAPSHOT.pom
[JENKINS] Archiving <https://builds.apache.org/job/xmlgraphics-fop/ws/fop-core/pom.xml> to org.apache.xmlgraphics/fop-core/2.3.0-SNAPSHOT/fop-core-2.3.0-SNAPSHOT.pom
[JENKINS] Archiving <https://builds.apache.org/job/xmlgraphics-fop/ws/fop/pom.xml> to org.apache.xmlgraphics/fop/2.3.0-SNAPSHOT/fop-2.3.0-SNAPSHOT.pom
[JENKINS] Archiving <https://builds.apache.org/job/xmlgraphics-fop/ws/fop-servlet/pom.xml> to org.apache.xmlgraphics/fop-servlet/2.3.0-SNAPSHOT/fop-servlet-2.3.0-SNAPSHOT.pom
[JENKINS] Archiving <https://builds.apache.org/job/xmlgraphics-fop/ws/fop-transcoder-allinone/pom.xml> to org.apache.xmlgraphics/fop-transcoder-allinone/2.3.0-SNAPSHOT/fop-transcoder-allinone-2.3.0-SNAPSHOT.pom
[JENKINS] Archiving <https://builds.apache.org/job/xmlgraphics-fop/ws/fop-util/pom.xml> to org.apache.xmlgraphics/fop-util/2.3.0-SNAPSHOT/fop-util-2.3.0-SNAPSHOT.pom
[JENKINS] Archiving <https://builds.apache.org/job/xmlgraphics-fop/ws/fop-events/pom.xml> to org.apache.xmlgraphics/fop-events/2.3.0-SNAPSHOT/fop-events-2.3.0-SNAPSHOT.pom
[JENKINS] Archiving <https://builds.apache.org/job/xmlgraphics-fop/ws/fop-transcoder/pom.xml> to org.apache.xmlgraphics/fop-transcoder/2.3.0-SNAPSHOT/fop-transcoder-2.3.0-SNAPSHOT.pom
channel stopped
Reply | Threaded
Open this post in threaded view
|

Jenkins build is back to normal : xmlgraphics-fop #120

Apache Jenkins Server